{"text_format":"3","workbook":"xlsx","n_sheets":12,"sheets":["CONTENIDO E INSTRUCCIONES","1_Datos generales organización","2_Combustibles fósiles","3_Fluorados","4_Electricidad","5_Información adicional","6_Resultados","7_Factores de emisión","8. Observaciones","9. Consumos. Hoja de trabajo","10. Revisiones calculadora","Datos"],"not_rendered":{"charts":4,"images":6,"defined_names":48},"read":"whole","date_system":"1900"}

{"sheet":"CONTENIDO E INSTRUCCIONES","index":0,"n_rows":43,"n_cols":13,"rows_kept":43,"merged":[[3,4,6,10],[4,12,5,12],[9,1,10,12],[12,2,12,3],[12,4,12,11],[14,2,14,3],[14,4,14,11],[16,2,16,3],[16,4,16,11],[18,2,18,3],[18,4,18,11],[20,2,20,3],[20,4,20,11],[22,2,22,3],[22,4,22,11],[24,2,24,3],[24,4,24,11],[26,2,26,3],[26,4,26,11],[28,2,28,3],[28,4,28,11],[30,2,30,3],[30,4,30,11]]}
[]
[]
[]
[{"$nulls":4},"CALCULADORA DE HUELLA DE CARBONO DE ALCANCE 1+2 \nPARA ORGANIZACIONES\n2010 - 2019"]
[{"$nulls":12},"V.20"]
[]
[]
[]
[null,"CONTENIDO"]
[null,"En la presente edición se ha añadido la pestaña 9. Consumos. Hoja de trabajo. Si le facilita el trabajo, puede recopilar en esta hoja los datos de consumo desglosados según facturas, lecturas de contadores, etc."]
[]
[]
[null,null,"1.",null,"Datos generales de la organización"]
[]
[null,null,"2.",null,"Huella de carbono Alcance 1: Combustibles fósiles"]
[]
[null,null,"3.",null,"Huella de carbono Alcance 1: Fugas de gases fluorados (equipos de climatización y refrigeración)"]
[]
[null,null,"4.",null,"Huella de carbono Alcance 2: Electricidad"]
[]
[null,null,"5.",null,"Información adicional: Renovables"]
[]
[null,null,"6.",null,"Informe final: Resultados"]
[]
[null,null,"7.",null,"Factores de emisión y PCA"]
[]
[null,null,"8.",null,"Observaciones / Explicaciones. Ayuda para la correcta cumplimentación"]
[]
[null,null,"9.",null,"Consumos. Hoja de trabajo"]
[]
[null,null,"10.",null,"Revisiones de la calculadora"]
[]
[null,"INSTRUCCIONES PARA LA CUMPLIMENTACIÓN: USO DE LA CALCULADORA"]
[]
[]
[]
[]
[{"$nulls":4}," Dato numérico a introducir en las unidades indicadas",{"$nulls":3}," Factores de emisión y Potenciales de calentamiento global"]
[{"$nulls":4}," Dato a introducir entre los considerados en el desplegable",{"$nulls":3}," Resultado parcial de emisiones"]
[{"$nulls":4}," Dato de cumplimentación voluntaria",{"$nulls":3}," Resultado total de emisiones"]
[]
[{"$nulls":12}," "]
[{"$nulls":5},"        Observaciones o explicaciones que servirán de ayuda para la correcta cumplimentación"]

{"sheet":"1_Datos generales organización","index":1,"n_rows":42,"n_cols":25,"rows_kept":42,"merged":[[0,2,0,14],[2,3,2,5],[4,3,4,8],[4,10,4,12],[5,3,5,8],[5,10,5,12],[7,3,7,12],[8,3,8,12],[10,3,12,13],[21,3,22,13],[24,8,25,8],[24,9,24,11],[33,3,34,13]]}
[null,null,"                                          DATOS GENERALES DE LA ORGANIZACIÓN                                                                             "]
[]
["1. Datos de la organización",null,null,"AÑO DE CÁLCULO"]
["2. HC Alcance 1: Comb. fósiles"]
["3. HC Alcance 1: Fugas fluorados",null,null,"NOMBRE DE LA ORGANIZACIÓN",{"$nulls":5},"C.I.F. / N.I.F.","  TIPO DE ORGANIZACIÓN 8 (1)                           ",{"$nulls":13},{"$f":"D6","v":0}]
["4. HC 2: Electricidad",{"$nulls":23},{"$f":"D9","v":0}]
["5. Inf. adicional: renovables"]
["6. Informe final: Resultados",null,null,"SECTOR (2)"]
["7. Factores de emisión, PCG, mix"]
["8. Ayuda: observaciones"]
["9. Consumos. Hoja de trabajo",null,null,"En el caso de haber calculado la huella de carbono de su organización para otros años anteriores, indique a continuación cuáles son y los valores de huella de carbono de alcance 1+2 obtenidos. Comience a introducir los datos por el AÑO 1."]
[]
[]
[{"$nulls":6},"AÑO 1",null,null,"HC AÑO 1",null,"t CO2 eq"]
[]
[{"$nulls":6},"AÑO 2",null,null,"HC AÑO 2",null,"t CO2 eq"]
[{"$nulls":5},"(3)",null,null,"(4)"]
[{"$nulls":6},"AÑO 3",null,null,"HC AÑO 3",null,"t CO2 eq","  "]
[]
[{"$nulls":6},"AÑO de cálculo",{"$f":"IF(ISNUMBER(G3),G3,\"\")","v":""},null,"HC año de cálculo",{"$f":"IF((Datos!E244)>0,Datos!E244,\"\")","v":""},"t CO2 eq"]
[]
[{"$nulls":3},"A continuación deberá indicar el índice (nombre, valor numérico y unidades) que refleje de manera más adecuada el nivel de actividad de su organización. \nEn el apartado 6_Resultados podrá encontrar el valor del ratio de emisiones referido a este índice."]
[]
[]
[{"$nulls":8},"AÑO","ÍNDICE DE ACTIVIDAD"]
[{"$nulls":9},"Nombre","Valor numérico","Unidades"]
[{"$nulls":7},"AÑO de cálculo",{"$f":"IF(ISNUMBER(H20),H20,\"\")","v":""}]
[]
[{"$nulls":6},"(5)","Año 1",{"$f":"IF(ISNUMBER(H14),H14,\"\")","v":""},{"$f":"IF(AND(ISNUMBER(I29),ISTEXT(J27)),J27,\"\")","v":""},null,{"$f":"IF(AND(ISNUMBER(I29),ISTEXT(L27)),L27,\"\")","v":""}]
[{"$nulls":7},"Año 2",{"$f":"IF(ISNUMBER(H16),H16,\"\")","v":""},{"$f":"IF(AND(ISNUMBER(I30),ISTEXT(J27)),J27,\"\")","v":""},null,{"$f":"IF(AND(ISNUMBER(I30),ISTEXT(L27)),L27,\"\")","v":""}]
[{"$nulls":7},"Año 3",{"$f":"IF(ISNUMBER(H18),H18,\"\")","v":""},{"$f":"IF(AND(ISNUMBER(I31),ISTEXT(J27)),J27,\"\")","v":""},null,{"$f":"IF(AND(ISNUMBER(I31),ISTEXT(L27)),L27,\"\")","v":""}]
[]
[]
[{"$nulls":3},"De manera opcional, puede cumplimentar los datos de superficie y nº de empleados de su organización con el fin de obtener resultados relativos a estos parámetros en la hoja 6_Resultados."]
[]
[]
[{"$nulls":8},"AÑO","  Superficie (m2)","  Nº de empleados"]
[{"$nulls":7},"Año de cálculo",{"$f":"IF(ISNUMBER(H20),H20,\"\")","v":""}]
[]
[{"$nulls":6},"(6)","Año 1",{"$f":"IF(ISNUMBER(H14),H14,\"\")","v":""}]
[{"$nulls":7},"Año 2",{"$f":"IF(ISNUMBER(H16),H16,\"\")","v":""}]
[{"$nulls":7},"Año 3",{"$f":"IF(ISNUMBER(H18),H18,\"\")","v":""}]

{"sheet":"2_Combustibles fósiles","index":2,"n_rows":107,"n_cols":16,"rows_kept":107,"merged":[[0,2,0,16],[2,4,3,15],[6,4,7,15],[10,4,10,15],[11,3,11,15],[13,4,13,10],[14,4,15,4],[14,5,15,5],[14,6,15,6],[14,7,14,8],[14,9,15,9],[14,10,15,10],[39,4,39,15],[40,3,40,15],[43,4,44,11],[45,4,45,10],[46,4,46,10],[47,4,47,10],[48,4,50,11],[53,4,53,15],[54,4,54,15],[55,4,55,15],[57,4,57,14],[57,15,60,15],[58,4,58,9],[58,10,58,14],[59,4,60,4],[59,5,60,5],[59,6,59,7],[59,8,60,8],[59,9,60,9],[59,10,60,11],[59,12,60,12],[59,13,60,13],[59,14,60,14],[61,10,61,11],[62,10,62,11],[63,10,63,11],[64,10,64,11],[65,10,65,11],[66,10,66,11],[67,10,67,11],[68,10,68,11],[69,10,69,11],[70,10,70,11],[71,10,71,11],[72,10,72,11],[73,10,73,11],[74,10,74,11],[75,10,75,11],[76,10,76,11],[77,10,77,11],[78,10,78,11],[79,10,79,11],[80,10,80,11],[82,4,82,15]]}
[null,null,"                                          ALCANCE 1: COMBUSTIBLES FÓSILES"]
[]
["1. Datos de la organización",{"$nulls":3},"Cumplimentar en caso de que la organización, para el desarrollo de su actividad:"]
["2. HC Alcance 1: Comb. fósiles"]
["3. HC Alcance 1: Fugas fluorados",{"$nulls":3},"A.   Disponga de instalaciones fijas (calderas, hornos, turbinas, etc.) que consuman combustibles fósiles para la generación de calor y/o vapor"]
["4. HC 2: Electricidad",{"$nulls":3},"B.   Realice desplazamientos en vehículos propios o alquilados (ya sean turismos, camiones, furgonetas, motos, etc.) "]
["5. Inf. adicional: renovables",{"$nulls":3},"En caso de que la organización consuma electricidad, calor o vapor proveniente de sus propias instalaciones de energía renovable, puede incluir datos relativos a las mismas en la pestaña 5_Información adicional."]
["6. Informe final: Resultados"]
[]
[]
["7. Factores de emisión, PCG, mix"]
["8. Ayuda: observaciones",null,null,"A.    INSTALACIONES FIJAS"]
["9. Consumos. Hoja de trabajo",{"$nulls":3},{"$f":"IF(ISNUMBER('1_Datos generales organización'!G3),\"\",\"Para que aparezca el factor de emisión según tipo de combustible, introduzca el AÑO DE CÁLCULO en la pestaña 1_Datos generales de la organización\")","v":"Para que aparezca el factor de emisión según tipo de combustible, introduzca el AÑO DE CÁLCULO en la pestaña 1_Datos generales de la organización"}]
[{"$nulls":4},"CONSUMO DE COMBUSTIBLES EN INSTALACIONES FIJAS"]
[{"$nulls":4},"Edificio / Sede (1)","\n Tipo de Combustible (2)","Cantidad comb. (ud) (3)\n","    Factor emisión \n     (kg CO2/ud) (4)",null,"Emisiones parciales\n(kg CO2) ","EMISIONES \nTOTALES INSTALAC. FIJAS\n(kg CO2) "]
[{"$nulls":7},"Por defecto","           Otros"]
[{"$nulls":4},"edificio",{"$nulls":4},"emisiones"]
[{"$nulls":7},{"$f":"IF(OR(ISNUMBER(Datos!Q87),ISTEXT(Datos!Q87)),Datos!Q87,\"\")","v":""},null,{"$f":"IF(AND(ISNUMBER(G18),ISNUMBER(Datos!R87)),Datos!R87,\"\")","v":""},{"$f":"SUM(J18:J39)","v":{"v":0,"d":"0.00"}}]
[{"$nulls":7},{"$f":"IF(OR(ISNUMBER(Datos!Q88),ISTEXT(Datos!Q88)),Datos!Q88,\"\")","v":""},null,{"$f":"IF(AND(ISNUMBER(G19),ISNUMBER(Datos!R88)),Datos!R88,\"\")","v":""}]
[{"$nulls":7},{"$f":"IF(OR(ISNUMBER(Datos!Q89),ISTEXT(Datos!Q89)),Datos!Q89,\"\")","v":""},null,{"$f":"IF(AND(ISNUMBER(G20),ISNUMBER(Datos!R89)),Datos!R89,\"\")","v":""}]
[{"$nulls":7},{"$f":"IF(OR(ISNUMBER(Datos!Q90),ISTEXT(Datos!Q90)),Datos!Q90,\"\")","v":""},null,{"$f":"IF(AND(ISNUMBER(G21),ISNUMBER(Datos!R90)),Datos!R90,\"\")","v":""}]
[{"$nulls":7},{"$f":"IF(OR(ISNUMBER(Datos!Q91),ISTEXT(Datos!Q91)),Datos!Q91,\"\")","v":""},null,{"$f":"IF(AND(ISNUMBER(G22),ISNUMBER(Datos!R91)),Datos!R91,\"\")","v":""}]
[{"$nulls":7},{"$f":"IF(OR(ISNUMBER(Datos!Q92),ISTEXT(Datos!Q92)),Datos!Q92,\"\")","v":""},null,{"$f":"IF(AND(ISNUMBER(G23),ISNUMBER(Datos!R92)),Datos!R92,\"\")","v":""}]
[{"$nulls":7},{"$f":"IF(OR(ISNUMBER(Datos!Q93),ISTEXT(Datos!Q93)),Datos!Q93,\"\")","v":""},null,{"$f":"IF(AND(ISNUMBER(G24),ISNUMBER(Datos!R93)),Datos!R93,\"\")","v":""}]
[{"$nulls":7},{"$f":"IF(OR(ISNUMBER(Datos!Q94),ISTEXT(Datos!Q94)),Datos!Q94,\"\")","v":""},null,{"$f":"IF(AND(ISNUMBER(G25),ISNUMBER(Datos!R94)),Datos!R94,\"\")","v":""}]
[{"$nulls":7},{"$f":"IF(OR(ISNUMBER(Datos!Q95),ISTEXT(Datos!Q95)),Datos!Q95,\"\")","v":""},null,{"$f":"IF(AND(ISNUMBER(G26),ISNUMBER(Datos!R95)),Datos!R95,\"\")","v":""}]
[{"$nulls":7},{"$f":"IF(OR(ISNUMBER(Datos!Q96),ISTEXT(Datos!Q96)),Datos!Q96,\"\")","v":""},null,{"$f":"IF(AND(ISNUMBER(G27),ISNUMBER(Datos!R96)),Datos!R96,\"\")","v":""}]
[{"$nulls":7},{"$f":"IF(OR(ISNUMBER(Datos!Q97),ISTEXT(Datos!Q97)),Datos!Q97,\"\")","v":""},null,{"$f":"IF(AND(ISNUMBER(G28),ISNUMBER(Datos!R97)),Datos!R97,\"\")","v":""}]
[{"$nulls":7},{"$f":"IF(OR(ISNUMBER(Datos!Q98),ISTEXT(Datos!Q98)),Datos!Q98,\"\")","v":""},null,{"$f":"IF(AND(ISNUMBER(G29),ISNUMBER(Datos!R98)),Datos!R98,\"\")","v":""}]
[{"$nulls":7},{"$f":"IF(OR(ISNUMBER(Datos!Q99),ISTEXT(Datos!Q99)),Datos!Q99,\"\")","v":""},null,{"$f":"IF(AND(ISNUMBER(G30),ISNUMBER(Datos!R99)),Datos!R99,\"\")","v":""}]
[{"$nulls":7},{"$f":"IF(OR(ISNUMBER(Datos!Q100),ISTEXT(Datos!Q100)),Datos!Q100,\"\")","v":""},null,{"$f":"IF(AND(ISNUMBER(G31),ISNUMBER(Datos!R100)),Datos!R100,\"\")","v":""}]
[{"$nulls":7},{"$f":"IF(OR(ISNUMBER(Datos!Q101),ISTEXT(Datos!Q101)),Datos!Q101,\"\")","v":""},null,{"$f":"IF(AND(ISNUMBER(G32),ISNUMBER(Datos!R101)),Datos!R101,\"\")","v":""}]
[{"$nulls":7},{"$f":"IF(OR(ISNUMBER(Datos!Q102),ISTEXT(Datos!Q102)),Datos!Q102,\"\")","v":""},null,{"$f":"IF(AND(ISNUMBER(G33),ISNUMBER(Datos!R102)),Datos!R102,\"\")","v":""}]
[{"$nulls":7},{"$f":"IF(OR(ISNUMBER(Datos!Q103),ISTEXT(Datos!Q103)),Datos!Q103,\"\")","v":""},null,{"$f":"IF(AND(ISNUMBER(G34),ISNUMBER(Datos!R103)),Datos!R103,\"\")","v":""}]
[{"$nulls":7},{"$f":"IF(OR(ISNUMBER(Datos!Q104),ISTEXT(Datos!Q104)),Datos!Q104,\"\")","v":""},null,{"$f":"IF(AND(ISNUMBER(G35),ISNUMBER(Datos!R104)),Datos!R104,\"\")","v":""}]
[{"$nulls":7},{"$f":"IF(OR(ISNUMBER(Datos!Q105),ISTEXT(Datos!Q105)),Datos!Q105,\"\")","v":""},null,{"$f":"IF(AND(ISNUMBER(G36),ISNUMBER(Datos!R105)),Datos!R105,\"\")","v":""}]
[{"$nulls":7},{"$f":"IF(OR(ISNUMBER(Datos!Q106),ISTEXT(Datos!Q106)),Datos!Q106,\"\")","v":""},null,{"$f":"IF(AND(ISNUMBER(G37),ISNUMBER(Datos!R106)),Datos!R106,\"\")","v":""}]
[{"$nulls":7},{"$f":"IF(OR(ISNUMBER(Datos!Q107),ISTEXT(Datos!Q107)),Datos!Q107,\"\")","v":""},null,{"$f":"IF(AND(ISNUMBER(G38),ISNUMBER(Datos!R107)),Datos!R107,\"\")","v":""}]
[{"$nulls":7},{"$f":"IF(OR(ISNUMBER(Datos!Q108),ISTEXT(Datos!Q108)),Datos!Q108,\"\")","v":""},null,{"$f":"IF(AND(ISNUMBER(G39),ISNUMBER(Datos!R108)),Datos!R108,\"\")","v":""}]
[{"$nulls":4},"* Factor de emisión del gas natural expresado en kgCO2/kWhPCS"]
[{"$nulls":3},"B.    DESPLAZAMIENTOS EN VEHÍCULOS QUE CONSUMEN COMBUSTIBLES FÓSILES"]
[]
[{"$nulls":4},"TIPO DE COMBUSTIBLE"]
[{"$nulls":4},"Se actualiza la denominación de los combustibles en base al Real Decreto 639/2016, de 9 de diciembre, por el que se establece un marco de medidas para la implantación de una infraestructura para los combustibles alternativos. Se trata de un etiquetado único y armonizado en todas las gasolineras de la Unión Europea y se basa en un sistema de símbolos, números y letras para la gasolina, diésel y combustibles gaseosos:"]
[]
[{"$nulls":4},"  - Círculo para combustibles tipo gasolina. Y dentro del círculo, la letra «E» (de «etanol») y un número que indica el porcentaje máximo de etanol."]
[{"$nulls":4},"  - Cuadrado para combustibles tipo gasóleo A. Y dentro la letra «B» de «biodiésel» y «XTL» para el diésel parafínico fabricado a partir de material fósil o renovable."]
[{"$nulls":4},"  - Rombo para combustibles gaseosos: «H2» (hidrógeno), «LPG» (gas licuado de petróleo o autogas), «CNG» (gas natural comprimido), «LNG» (gas natural licuado)."]
[{"$nulls":4},"Si en su factura aparece el dato de combustible como gasolina o gasóleo A (no se especifica la proporción de biocombustible), deberá escoger la opción más conservadora que en caso de ser gasolina será «E5», y en caso de ser gasóleo A, será «B7».\nEn caso de que el combustible empleado no sea ninguno de los expresados anteriormente tiene la opción de indicar \"Otros (ud)\" y rellenar los datos correspondientes (valor y unidades del factor de emisión) en las respectivas celdas y en la pestaña 8. Observaciones       . \nEn concreto, si se trata de un biocombustible distinto a los indicados, le sugerimos que consulte el modo de calcular su factor de emisión en base a la proporción bio en la "]
[]
[]
[{"$nulls":4},"Guía para el cálculo de la huella de carbono y para la elaboración de un plan de mejora."]
[{"$nulls":4},"CUMPLIMENTACIÓN"]
[{"$nulls":4},"En caso de tratarse de vehículos eléctricos o vehículos híbridos deberá seguir las siguientes indicaciones para cumplimentar sus datos de consumo:\n  - Vehículo híbrido no enchufable: indicar en la presente pestaña los litros de combustible fósil consumido\n  - Vehículo híbrido enchufable: en la presente pestaña indicar los litros de combustible fósil consumido y en la pestaña 4_Electricidad, los kWh consumidos\n  - Vehículo eléctrico: indicar los kWh consumidos en la pestaña 4_Electricidad"]
[{"$nulls":4},"Por otra parte, únicamente será necesario cumplimentar una de las dos opciones (B.1 o B.2) en función de los datos disponibles:\n       Opción B.1: Los datos necesarios son el tipo y la cantidad de combustible consumido."]
[{"$nulls":4},"         Opción B.2: Los datos necesarios son el modelo de coche, tipo de combustible y los km recorridos. "]
[]
[{"$nulls":4},"               CONSUMO DE COMBUSTIBLES EN DESPLAZAMIENTOS (5)",{"$nulls":10},"EMISIONES \nTOTALES TRANSPORTE\n(kg CO2) "]
[{"$nulls":4},"Opción B.1 (Combustible consumido)",{"$nulls":5},"Opción B.2 (km recorridos y modelo de coche)"]
[{"$nulls":4},"Vehículo o flota de vehículos (6)\n","Tipo de Combustible (7)\n","Factor emisión\n(kg CO2/ud) (8) ",null,"Cantidad comb. (ud) (9)\n","Emisiones parciales B.1 \n(kg CO2) ","Modelo de coche",null,"km recorridos","g CO2/km \nIDAE (10)\n","Emisiones parciales B.2 \n(kg CO2) "]
[{"$nulls":6},"Por defecto","Otros"]
[{"$nulls":6},{"$f":"IF(OR(ISNUMBER(Datos!P115),ISTEXT(Datos!P115)),Datos!P115,\"\")","v":""},null,null,{"$f":"IF(AND(ISNUMBER(I62),ISNUMBER(Datos!Q115)),Datos!Q115,\"\")","v":""},{"$nulls":4},{"$f":"IF(Datos!R115=0,\"\",Datos!R115)","v":""},{"$f":"SUM(J82+O82)","v":{"v":0,"d":"0.00"}}]
[{"$nulls":6},{"$f":"IF(OR(ISNUMBER(Datos!P116),ISTEXT(Datos!P116)),Datos!P116,\"\")","v":""},null,null,{"$f":"IF(AND(ISNUMBER(I63),ISNUMBER(Datos!Q116)),Datos!Q116,\"\")","v":""},{"$nulls":4},{"$f":"IF(Datos!R116=0,\"\",Datos!R116)","v":""}]
[{"$nulls":6},{"$f":"IF(OR(ISNUMBER(Datos!P117),ISTEXT(Datos!P117)),Datos!P117,\"\")","v":""},null,null,{"$f":"IF(AND(ISNUMBER(I64),ISNUMBER(Datos!Q117)),Datos!Q117,\"\")","v":""},{"$nulls":4},{"$f":"IF(Datos!R117=0,\"\",Datos!R117)","v":""}]
[{"$nulls":6},{"$f":"IF(OR(ISNUMBER(Datos!P118),ISTEXT(Datos!P118)),Datos!P118,\"\")","v":""},null,null,{"$f":"IF(AND(ISNUMBER(I65),ISNUMBER(Datos!Q118)),Datos!Q118,\"\")","v":""},{"$nulls":4},{"$f":"IF(Datos!R118=0,\"\",Datos!R118)","v":""}]
[{"$nulls":6},{"$f":"IF(OR(ISNUMBER(Datos!P119),ISTEXT(Datos!P119)),Datos!P119,\"\")","v":""},null,null,{"$f":"IF(AND(ISNUMBER(I66),ISNUMBER(Datos!Q119)),Datos!Q119,\"\")","v":""},{"$nulls":4},{"$f":"IF(Datos!R119=0,\"\",Datos!R119)","v":""}]
[{"$nulls":6},{"$f":"IF(OR(ISNUMBER(Datos!P120),ISTEXT(Datos!P120)),Datos!P120,\"\")","v":""},null,null,{"$f":"IF(AND(ISNUMBER(I67),ISNUMBER(Datos!Q120)),Datos!Q120,\"\")","v":""},{"$nulls":4},{"$f":"IF(Datos!R120=0,\"\",Datos!R120)","v":""}]
[{"$nulls":6},{"$f":"IF(OR(ISNUMBER(Datos!P121),ISTEXT(Datos!P121)),Datos!P121,\"\")","v":""},null,null,{"$f":"IF(AND(ISNUMBER(I68),ISNUMBER(Datos!Q121)),Datos!Q121,\"\")","v":""},{"$nulls":4},{"$f":"IF(Datos!R121=0,\"\",Datos!R121)","v":""}]
[{"$nulls":6},{"$f":"IF(OR(ISNUMBER(Datos!P122),ISTEXT(Datos!P122)),Datos!P122,\"\")","v":""},null,null,{"$f":"IF(AND(ISNUMBER(I69),ISNUMBER(Datos!Q122)),Datos!Q122,\"\")","v":""},{"$nulls":4},{"$f":"IF(Datos!R122=0,\"\",Datos!R122)","v":""}]
[{"$nulls":6},{"$f":"IF(OR(ISNUMBER(Datos!P123),ISTEXT(Datos!P123)),Datos!P123,\"\")","v":""},null,null,{"$f":"IF(AND(ISNUMBER(I70),ISNUMBER(Datos!Q123)),Datos!Q123,\"\")","v":""},{"$nulls":4},{"$f":"IF(Datos!R123=0,\"\",Datos!R123)","v":""}]
[{"$nulls":6},{"$f":"IF(OR(ISNUMBER(Datos!P124),ISTEXT(Datos!P124)),Datos!P124,\"\")","v":""},null,null,{"$f":"IF(AND(ISNUMBER(I71),ISNUMBER(Datos!Q124)),Datos!Q124,\"\")","v":""},{"$nulls":4},{"$f":"IF(Datos!R124=0,\"\",Datos!R124)","v":""}]
[{"$nulls":6},{"$f":"IF(OR(ISNUMBER(Datos!P125),ISTEXT(Datos!P125)),Datos!P125,\"\")","v":""},null,null,{"$f":"IF(AND(ISNUMBER(I72),ISNUMBER(Datos!Q125)),Datos!Q125,\"\")","v":""},{"$nulls":4},{"$f":"IF(Datos!R125=0,\"\",Datos!R125)","v":""}]
[{"$nulls":6},{"$f":"IF(OR(ISNUMBER(Datos!P126),ISTEXT(Datos!P126)),Datos!P126,\"\")","v":""},null,null,{"$f":"IF(AND(ISNUMBER(I73),ISNUMBER(Datos!Q126)),Datos!Q126,\"\")","v":""},{"$nulls":4},{"$f":"IF(Datos!R126=0,\"\",Datos!R126)","v":""}]
[{"$nulls":6},{"$f":"IF(OR(ISNUMBER(Datos!P127),ISTEXT(Datos!P127)),Datos!P127,\"\")","v":""},null,null,{"$f":"IF(AND(ISNUMBER(I74),ISNUMBER(Datos!Q127)),Datos!Q127,\"\")","v":""},{"$nulls":4},{"$f":"IF(Datos!R127=0,\"\",Datos!R127)","v":""}]
[{"$nulls":6},{"$f":"IF(OR(ISNUMBER(Datos!P128),ISTEXT(Datos!P128)),Datos!P128,\"\")","v":""},null,null,{"$f":"IF(AND(ISNUMBER(I75),ISNUMBER(Datos!Q128)),Datos!Q128,\"\")","v":""},{"$nulls":4},{"$f":"IF(Datos!R128=0,\"\",Datos!R128)","v":""}]
[{"$nulls":6},{"$f":"IF(OR(ISNUMBER(Datos!P129),ISTEXT(Datos!P129)),Datos!P129,\"\")","v":""},null,null,{"$f":"IF(AND(ISNUMBER(I76),ISNUMBER(Datos!Q129)),Datos!Q129,\"\")","v":""},{"$nulls":4},{"$f":"IF(Datos!R129=0,\"\",Datos!R129)","v":""}]
[{"$nulls":6},{"$f":"IF(OR(ISNUMBER(Datos!P130),ISTEXT(Datos!P130)),Datos!P130,\"\")","v":""},null,null,{"$f":"IF(AND(ISNUMBER(I77),ISNUMBER(Datos!Q130)),Datos!Q130,\"\")","v":""},{"$nulls":4},{"$f":"IF(Datos!R130=0,\"\",Datos!R130)","v":""}]
[{"$nulls":6},{"$f":"IF(OR(ISNUMBER(Datos!P131),ISTEXT(Datos!P131)),Datos!P131,\"\")","v":""},null,null,{"$f":"IF(AND(ISNUMBER(I78),ISNUMBER(Datos!Q131)),Datos!Q131,\"\")","v":""},{"$nulls":4},{"$f":"IF(Datos!R131=0,\"\",Datos!R131)","v":""}]
[{"$nulls":6},{"$f":"IF(OR(ISNUMBER(Datos!P132),ISTEXT(Datos!P132)),Datos!P132,\"\")","v":""},null,null,{"$f":"IF(AND(ISNUMBER(I79),ISNUMBER(Datos!Q132)),Datos!Q132,\"\")","v":""},{"$nulls":4},{"$f":"IF(Datos!R132=0,\"\",Datos!R132)","v":""}]
[{"$nulls":6},{"$f":"IF(OR(ISNUMBER(Datos!P133),ISTEXT(Datos!P133)),Datos!P133,\"\")","v":""},null,null,{"$f":"IF(AND(ISNUMBER(I80),ISNUMBER(Datos!Q133)),Datos!Q133,\"\")","v":""},{"$nulls":4},{"$f":"IF(Datos!R133=0,\"\",Datos!R133)","v":""}]
[{"$nulls":6},{"$f":"IF(OR(ISNUMBER(Datos!P134),ISTEXT(Datos!P134)),Datos!P134,\"\")","v":""},null,null,{"$f":"IF(AND(ISNUMBER(I81),ISNUMBER(Datos!Q134)),Datos!Q134,\"\")","v":""},{"$nulls":4},{"$f":"IF(Datos!R134=0,\"\",Datos!R134)","v":""}]
[{"$nulls":9},{"$f":"SUM(J62:J81)","v":{"v":0,"d":"0.00"}},{"$nulls":4},{"$f":"SUM(O62:O81)","v":{"v":0,"d":"0.00"}}]
[{"$nulls":4},"* Factor de emisión del gas natural expresado en kgCO2/kWhPCS"]
{"$rows_empty":22}
[{"$nulls":13},{"$f":"K18","v":{"v":0,"d":"0.00"}}]
[{"$nulls":13},{"$f":"P62","v":{"v":0,"d":"0.00"}}]

{"sheet":"3_Fluorados","index":3,"n_rows":38,"n_cols":15,"rows_kept":38,"merged":[[0,2,0,15],[2,3,3,14],[5,4,6,14],[7,4,7,9],[7,10,9,10],[7,11,9,11],[7,12,9,12],[7,13,9,13],[7,14,9,14],[8,4,9,4],[8,5,9,5],[8,6,9,6],[8,7,8,8],[8,9,9,9],[34,4,35,14],[38,6,38,15]]}
[null,null,"                                           ALCANCE 1: EMISIONES FUGITIVAS - FLUORADOS"]
[]
["1. Datos de la organización",null,null,"Cumplimentar en caso de que la organización disponga de equipos de refrigeración y/o climatización que utilicen gases refrigerantes fluorados y de que se haya detectado que se han producido fugas (ya sea por su uso, un accidente, etc.) de estos gases en los mismos. "]
["2. HC Alcance 1: Comb. fósiles"]
["3. HC Alcance 1: Fugas fluorados"]
["4. HC 2: Electricidad",{"$nulls":3},"REFRIGERACIÓN Y CLIMATIZACIÓN (FUGA DE GASES FLUORADOS)"]
["5. Inf. adicional: renovables"]
["6. Informe final: Resultados",{"$nulls":3},"Refrigerante de cada equipo",{"$nulls":5}," Tipo de equipo","Carga inicial del equipo \n(kg)","Recarga anual del equipo (4)\n(kg) ","Emisiones parciales\n(kg CO2eq)","Emisiones totales\n(kg CO2eq)"]
["7. Factores de emisión, PCG, mix",{"$nulls":3},"Edificio / Sede (1)","       Nombre del gas o \n        de la mezcla (2)","   PCA (3)","    OTRAS MEZCLAS *",null,"Fórmula  química"]
["8. Ayuda: observaciones",{"$nulls":6},"Nombre","PCA"]
[{"$nulls":4},"edificio",{"$nulls":8},"emisiones"]
["9. Consumos. Hoja de trabajo",{"$nulls":5},{"$f":"IF(ISNUMBER(Datos!I138),Datos!I138,\"\")","v":""},null,null,{"$f":"Datos!M138","v":""},{"$nulls":3},{"$f":"IF(AND(G12=\"\",M12=\"\"),\"\",IF(G12=\"\",ROUND((I12*M12),0),ROUND((G12*M12),0)))","v":""},{"$f":"SUM(N12:N33)","v":{"v":0,"d":"0.00"}}]
[{"$nulls":6},{"$f":"IF(ISNUMBER(Datos!I139),Datos!I139,\"\")","v":""},null,null,{"$f":"Datos!M139","v":""},{"$nulls":3},{"$f":"IF(AND(G13=\"\",M13=\"\"),\"\",IF(G13=\"\",ROUND((I13*M13),0),ROUND((G13*M13),0)))","v":""}]
[{"$nulls":6},{"$f":"IF(ISNUMBER(Datos!I140),Datos!I140,\"\")","v":""},null,null,{"$f":"Datos!M140","v":""},{"$nulls":3},""]
[{"$nulls":6},{"$f":"IF(ISNUMBER(Datos!I141),Datos!I141,\"\")","v":""},null,null,{"$f":"Datos!M141","v":""},{"$nulls":3},""]
[{"$nulls":6},{"$f":"IF(ISNUMBER(Datos!I142),Datos!I142,\"\")","v":""},null,null,{"$f":"Datos!M142","v":""},{"$nulls":3},""]
[{"$nulls":6},{"$f":"IF(ISNUMBER(Datos!I143),Datos!I143,\"\")","v":""},null,null,{"$f":"Datos!M143","v":""},{"$nulls":3},""]
[{"$nulls":6},{"$f":"IF(ISNUMBER(Datos!I144),Datos!I144,\"\")","v":""},null,null,{"$f":"Datos!M144","v":""},{"$nulls":3},""]
[{"$nulls":6},{"$f":"IF(ISNUMBER(Datos!I145),Datos!I145,\"\")","v":""},null,null,{"$f":"Datos!M145","v":""},{"$nulls":3},""]
[{"$nulls":6},{"$f":"IF(ISNUMBER(Datos!I146),Datos!I146,\"\")","v":""},null,null,{"$f":"Datos!M146","v":""},{"$nulls":3},""]
[{"$nulls":6},{"$f":"IF(ISNUMBER(Datos!I147),Datos!I147,\"\")","v":""},null,null,{"$f":"Datos!M147","v":""},{"$nulls":3},""]
[{"$nulls":6},{"$f":"IF(ISNUMBER(Datos!I148),Datos!I148,\"\")","v":""},null,null,{"$f":"Datos!M148","v":""},{"$nulls":3},""]
[{"$nulls":6},{"$f":"IF(ISNUMBER(Datos!I149),Datos!I149,\"\")","v":""},null,null,{"$f":"Datos!M149","v":""},{"$nulls":3},""]
[{"$nulls":6},{"$f":"IF(ISNUMBER(Datos!I150),Datos!I150,\"\")","v":""},null,null,{"$f":"Datos!M150","v":""},{"$nulls":3},""]
[{"$nulls":6},{"$f":"IF(ISNUMBER(Datos!I151),Datos!I151,\"\")","v":""},null,null,{"$f":"Datos!M151","v":""},{"$nulls":3},""]
[{"$nulls":6},{"$f":"IF(ISNUMBER(Datos!I152),Datos!I152,\"\")","v":""},null,null,{"$f":"Datos!M152","v":""},{"$nulls":3},""]
[{"$nulls":6},{"$f":"IF(ISNUMBER(Datos!I153),Datos!I153,\"\")","v":""},null,null,{"$f":"Datos!M153","v":""},{"$nulls":3},""]
[{"$nulls":6},{"$f":"IF(ISNUMBER(Datos!I154),Datos!I154,\"\")","v":""},null,null,{"$f":"Datos!M154","v":""},{"$nulls":3},""]
[{"$nulls":6},{"$f":"IF(ISNUMBER(Datos!I155),Datos!I155,\"\")","v":""},null,null,{"$f":"Datos!M155","v":""},{"$nulls":3},""]
[{"$nulls":6},{"$f":"IF(ISNUMBER(Datos!I156),Datos!I156,\"\")","v":""},null,null,{"$f":"Datos!M156","v":""},{"$nulls":3},{"$f":"IF(AND(G30=\"\",M30=\"\"),\"\",IF(G30=\"\",ROUND((I30*M30),0),ROUND((G30*M30),0)))","v":""}]
[{"$nulls":6},{"$f":"IF(ISNUMBER(Datos!I157),Datos!I157,\"\")","v":""},null,null,{"$f":"Datos!M157","v":""},{"$nulls":3},{"$f":"IF(AND(G31=\"\",M31=\"\"),\"\",IF(G31=\"\",ROUND((I31*M31),0),ROUND((G31*M31),0)))","v":""}]
[{"$nulls":6},{"$f":"IF(ISNUMBER(Datos!I158),Datos!I158,\"\")","v":""},null,null,{"$f":"Datos!M158","v":""},{"$nulls":3},""]
[{"$nulls":6},{"$f":"IF(ISNUMBER(Datos!I159),Datos!I159,\"\")","v":""},null,null,{"$f":"Datos!M159","v":""},{"$nulls":3},""]
[]
[{"$nulls":4},"* En caso de considerar otros gases puros (fluorados y no fluorados) no incluidos en el listado, puede consultar su PCA en los Anexos I, II, y IV del Reglamento (UE) N° 517/2014 del Parlamento Europeo y del Consejo, de 16 de abril de 2014, sobre los gases fluorados de efecto invernadero y por el que se deroga el Reglamento (CE) N° 842/2006. Asimismo, si incluye en el cálculo otras \"mezclas\" no contempladas en el listado, deberá calcular su PCA empleando los PCA para cada uno de sus componentes y en funión de la proporción que aparezcan en la mezcla. Puede consultar el PCA de los componentes en la pestaña 7_Factores de emisión y, en su defecto, en el Reglamento (UE) nº 517/2014."]
[]
[]
[{"$nulls":4},"Nota: las emisiones calculadas en este apartado se deben a fugas que han podido producirse durante años anteriores pero no han sido registradas hasta el año en que se realiza su recarga."]

{"sheet":"4_Electricidad","index":4,"n_rows":96,"n_cols":16,"rows_kept":96,"merged":[[0,2,0,12],[2,3,3,11],[4,3,4,10],[6,3,7,10],[8,3,13,10],[14,3,14,11],[15,4,15,10],[16,4,17,4],[16,6,17,6],[16,7,17,7],[16,8,17,8],[16,9,17,9],[16,10,17,10],[42,3,42,10],[43,3,43,10],[44,4,44,10],[45,4,45,10],[46,4,47,4],[46,6,47,6],[46,7,47,7],[46,8,47,8],[46,9,47,9],[46,10,47,10],[93,5,93,10],[95,5,95,8]]}
[null,null,"                                           ALCANCE 2: ELECTRICIDAD",{"$nulls":12},{"$f":"'1_Datos generales organización'!G3","v":0}]
[]
["1. Datos de la organización",null,null,"Cumplimentar en caso de que la organización, para el desarrollo de su actividad, consuma electricidad contratada (comprada) en sus edificios y/o disponga de vehículos eléctricos y/o híbridos enchufables."]
["2. HC Alcance 1: Comb. fósiles"]
["3. HC Alcance 1: Fugas fluorados",null,null,"CONSUMO DE ELECTRICIDAD EN EDIFICIOS"]
["4. HC 2: Electricidad"]
["5. Inf. adicional: renovables",null,null,"Se excluyen las emisiones derivadas de la electricidad comprada para ser revendida y las emisiones procedentes de la transmisión y distribución de la electricidad. Estas emisiones formarían parte de las emisiones indirectas de alcance 3, que no se incluyen en la presente calculadora."]
["6. Informe final: Resultados"]
["7. Factores de emisión, PCG, mix",null,null,"En el siguiente cuadro tendrá que reflejar si la electricidad contratada dispone de certificado de Garantía de Origen (GdO) de la electricidad procedente de fuentes de energía renovable. Además, tendrá que indicar la suma de los kWh consumidos durante el año según las diferentes comercializadoras que tenga contratadas. En caso de que su comercializadora no sea ninguna de las que aparece en el listado, deberá indicar la opción \"Otras\". En caso de multisuministro, en lugar de desglosar los consumos según comercializadoras, puede escoger también la opción \"Varias comercializadoras\" en cuyo caso tendrá que indicar la suma de los kWh consumidos durante el año para todas las comercializadoras."]
[]
["8. Ayuda: observaciones"]
["9. Consumos. Hoja de trabajo"]
[]
[]
[{"$nulls":3},{"$f":"IF(ISNUMBER('1_Datos generales organización'!$G$3),\"\",IF(OR(ISNUMBER(H20),ISNUMBER(H21),ISNUMBER(H22),ISNUMBER(H23),ISNUMBER(H24),ISNUMBER(H25),ISNUMBER(H26),ISNUMBER(H27),ISNUMBER(H28),ISNUMBER(H29),ISNUMBER(H30),ISNUMBER(H31),ISNUMBER(H32),ISNUMBER(H33),ISNUMBER(H34),ISNUMBER(H35),ISNUMBER(H36),ISNUMBER(H37),ISNUMBER(H40),ISNUMBER(H41)),\"Introduzca el AÑO DE CÁLCULO en la pestaña 1_Datos generales de la organización y en este mismo cuadro responda si dispone o no de GdO e indique la COMERCIALIZADORA que tiene contratada\",\"\"))","v":""}]
[{"$nulls":4},"ELECTRICIDAD EDIFICIOS"]
[{"$nulls":4},"Edificio / Sede  (1)","Nombre de la comercializadora suministradora de energía (3)","¿Dispone de Garantía de Origen (GdO)? (2)"," Dato de consumo (kWh) (4)","  Factor emisión \n         (kg CO2/kWh)(5)","Emisiones parciales\n(kg CO2)","Emisiones edificios\n(kg CO2)"]
[{"$nulls":5},{"$f":"IF(ISNUMBER('1_Datos generales organización'!G3),\"\",\"Introduzca previamente el AÑO DE CÁLCULO en la pestaña 1\")","v":"Introduzca previamente el AÑO DE CÁLCULO en la pestaña 1"}]
[{"$nulls":4},"edificio",{"$nulls":4},"emisiones"]
[{"$nulls":8},{"$f":"IF(G20=\"\",\"\",IF(G20=Datos!$H$186,0,IF(ISNUMBER(Datos!D186),Datos!D186,\"\")))","v":""},{"$f":"IF(I20=\"\",\"\",Datos!E186)","v":""},{"$f":"SUM(J20:J41)","v":{"v":0,"d":"0.00"}}]
[{"$nulls":8},{"$f":"IF(G21=\"\",\"\",IF(G21=Datos!$H$186,0,IF(ISNUMBER(Datos!D187),Datos!D187,\"\")))","v":""},{"$f":"IF(I21=\"\",\"\",Datos!E187)","v":""}]
[{"$nulls":8},{"$f":"IF(G22=\"\",\"\",IF(G22=Datos!$H$186,0,IF(ISNUMBER(Datos!D188),Datos!D188,\"\")))","v":""},{"$f":"IF(I22=\"\",\"\",Datos!E188)","v":""}]
[{"$nulls":8},{"$f":"IF(G23=\"\",\"\",IF(G23=Datos!$H$186,0,IF(ISNUMBER(Datos!D189),Datos!D189,\"\")))","v":""},{"$f":"IF(I23=\"\",\"\",Datos!E189)","v":""}]
[{"$nulls":8},{"$f":"IF(G24=\"\",\"\",IF(G24=Datos!$H$186,0,IF(ISNUMBER(Datos!D190),Datos!D190,\"\")))","v":""},{"$f":"IF(I24=\"\",\"\",Datos!E190)","v":""}]
[{"$nulls":8},{"$f":"IF(G25=\"\",\"\",IF(G25=Datos!$H$186,0,IF(ISNUMBER(Datos!D191),Datos!D191,\"\")))","v":""},{"$f":"IF(I25=\"\",\"\",Datos!E191)","v":""}]
[{"$nulls":8},{"$f":"IF(G26=\"\",\"\",IF(G26=Datos!$H$186,0,IF(ISNUMBER(Datos!D192),Datos!D192,\"\")))","v":""},{"$f":"IF(I26=\"\",\"\",Datos!E192)","v":""}]
[{"$nulls":8},{"$f":"IF(G27=\"\",\"\",IF(G27=Datos!$H$186,0,IF(ISNUMBER(Datos!D193),Datos!D193,\"\")))","v":""},{"$f":"IF(I27=\"\",\"\",Datos!E193)","v":""}]
[{"$nulls":8},{"$f":"IF(G28=\"\",\"\",IF(G28=Datos!$H$186,0,IF(ISNUMBER(Datos!D194),Datos!D194,\"\")))","v":""},{"$f":"IF(I28=\"\",\"\",Datos!E194)","v":""}]
[{"$nulls":8},{"$f":"IF(G29=\"\",\"\",IF(G29=Datos!$H$186,0,IF(ISNUMBER(Datos!D195),Datos!D195,\"\")))","v":""},{"$f":"IF(I29=\"\",\"\",Datos!E195)","v":""}]
[{"$nulls":8},{"$f":"IF(G30=\"\",\"\",IF(G30=Datos!$H$186,0,IF(ISNUMBER(Datos!D196),Datos!D196,\"\")))","v":""},{"$f":"IF(I30=\"\",\"\",Datos!E196)","v":""}]
[{"$nulls":8},{"$f":"IF(G31=\"\",\"\",IF(G31=Datos!$H$186,0,IF(ISNUMBER(Datos!D197),Datos!D197,\"\")))","v":""},{"$f":"IF(I31=\"\",\"\",Datos!E197)","v":""}]
[{"$nulls":8},{"$f":"IF(G32=\"\",\"\",IF(G32=Datos!$H$186,0,IF(ISNUMBER(Datos!D198),Datos!D198,\"\")))","v":""},{"$f":"IF(I32=\"\",\"\",Datos!E198)","v":""}]
[{"$nulls":8},{"$f":"IF(G33=\"\",\"\",IF(G33=Datos!$H$186,0,IF(ISNUMBER(Datos!D199),Datos!D199,\"\")))","v":""},{"$f":"IF(I33=\"\",\"\",Datos!E199)","v":""}]
[{"$nulls":8},{"$f":"IF(G34=\"\",\"\",IF(G34=Datos!$H$186,0,IF(ISNUMBER(Datos!D200),Datos!D200,\"\")))","v":""},{"$f":"IF(I34=\"\",\"\",Datos!E200)","v":""}]
[{"$nulls":8},{"$f":"IF(G35=\"\",\"\",IF(G35=Datos!$H$186,0,IF(ISNUMBER(Datos!D201),Datos!D201,\"\")))","v":""},{"$f":"IF(I35=\"\",\"\",Datos!E201)","v":""}]
[{"$nulls":8},{"$f":"IF(G36=\"\",\"\",IF(G36=Datos!$H$186,0,IF(ISNUMBER(Datos!D202),Datos!D202,\"\")))","v":""},{"$f":"IF(I36=\"\",\"\",Datos!E202)","v":""}]
[{"$nulls":8},{"$f":"IF(G37=\"\",\"\",IF(G37=Datos!$H$186,0,IF(ISNUMBER(Datos!D203),Datos!D203,\"\")))","v":""},{"$f":"IF(I37=\"\",\"\",Datos!E203)","v":""}]
[{"$nulls":8},{"$f":"IF(G38=\"\",\"\",IF(G38=Datos!$H$186,0,IF(ISNUMBER(Datos!D204),Datos!D204,\"\")))","v":""},{"$f":"IF(I38=\"\",\"\",Datos!E204)","v":""}]
[{"$nulls":8},{"$f":"IF(G39=\"\",\"\",IF(G39=Datos!$H$186,0,IF(ISNUMBER(Datos!D205),Datos!D205,\"\")))","v":""},{"$f":"IF(I39=\"\",\"\",Datos!E205)","v":""}]
[{"$nulls":8},{"$f":"IF(G40=\"\",\"\",IF(G40=Datos!$H$186,0,IF(ISNUMBER(Datos!D206),Datos!D206,\"\")))","v":""},{"$f":"IF(I40=\"\",\"\",Datos!E206)","v":""}]
[{"$nulls":8},{"$f":"IF(G41=\"\",\"\",IF(G41=Datos!$H$186,0,IF(ISNUMBER(Datos!D207),Datos!D207,\"\")))","v":""},{"$f":"IF(I41=\"\",\"\",Datos!E207)","v":""}]
[]
[{"$nulls":3},"CONSUMO DE ELECTRICIDAD EN VEHÍCULOS ELÉCTRICOS Y/O HÍBRIDOS ENCHUFABLES"]
[{"$nulls":3},"En caso de realizarse recargas de coches eléctricos o híbridos enchufables en electrolineras o puntos de recarga públicos, deberá indicar la opción “Otras” si desconoce cuál es la comercializadora que suministra la electricidad. Si las recargas se realizan en el lugar de trabajo pueden darse dos circunstancias: "]
[{"$nulls":4}," - La factura de electricidad incluye además de los consumos del edificio, los consumos de los puntos de recarga para vehículos del garaje (único CUP): en este caso no dispondrá del dato desglosado para vehículos y edificio y deberá incluir el dato global en el primer apartado de esta  pestaña. \n - Existen CUPS independientes para los consumos del edificio y para los puntos de recarga de los vehículos: en este caso deberá cumplimentar los dos apartados de esta pestaña a partir de las facturas de los distintos CUPS."]
[{"$nulls":4},"ELECTRICIDAD VEHÍCULOS ELÉCTRICOS Y/O HÍBRIDOS ENCHUFABLES"]
[{"$nulls":4},"Vehículo eléctrico o híbrido enchufable","Nombre de la comercializadora suministradora de energía","¿Dispone de Garantía de Origen (GdO)?"," Dato de consumo (kWh)","Factor emisión\n (kg CO2/kWh)","Emisiones parciales\n(kg CO2)","Emisiones vehículos\n(kg CO2)"]
[{"$nulls":5},{"$f":"IF(ISNUMBER('1_Datos generales organización'!G3),\"\",\"Introduzca previamente el AÑO DE CÁLCULO en la pestaña 1\")","v":"Introduzca previamente el AÑO DE CÁLCULO en la pestaña 1"}]
[{"$nulls":8},{"$f":"IF(G49=\"\",\"\",IF(G49=Datos!$H$186,0,IF(ISNUMBER(Datos!D211),Datos!D211,\"\")))","v":""},{"$f":"IF(I49=\"\",\"\",Datos!E211)","v":""},{"$f":"SUM(J49:J68)","v":{"v":0,"d":"0.00"}}]
[{"$nulls":8},{"$f":"IF(G50=\"\",\"\",IF(G50=Datos!$H$186,0,IF(ISNUMBER(Datos!D212),Datos!D212,\"\")))","v":""},{"$f":"IF(I50=\"\",\"\",Datos!E212)","v":""}]
[{"$nulls":8},{"$f":"IF(G51=\"\",\"\",IF(G51=Datos!$H$186,0,IF(ISNUMBER(Datos!D213),Datos!D213,\"\")))","v":""},{"$f":"IF(I51=\"\",\"\",Datos!E213)","v":""}]
[{"$nulls":8},{"$f":"IF(G52=\"\",\"\",IF(G52=Datos!$H$186,0,IF(ISNUMBER(Datos!D214),Datos!D214,\"\")))","v":""},{"$f":"IF(I52=\"\",\"\",Datos!E214)","v":""}]
[{"$nulls":8},{"$f":"IF(G53=\"\",\"\",IF(G53=Datos!$H$186,0,IF(ISNUMBER(Datos!D215),Datos!D215,\"\")))","v":""},{"$f":"IF(I53=\"\",\"\",Datos!E215)","v":""}]
[{"$nulls":8},{"$f":"IF(G54=\"\",\"\",IF(G54=Datos!$H$186,0,IF(ISNUMBER(Datos!D216),Datos!D216,\"\")))","v":""},{"$f":"IF(I54=\"\",\"\",Datos!E216)","v":""}]
[{"$nulls":8},{"$f":"IF(G55=\"\",\"\",IF(G55=Datos!$H$186,0,IF(ISNUMBER(Datos!D217),Datos!D217,\"\")))","v":""},{"$f":"IF(I55=\"\",\"\",Datos!E217)","v":""}]
[{"$nulls":8},{"$f":"IF(G56=\"\",\"\",IF(G56=Datos!$H$186,0,IF(ISNUMBER(Datos!D218),Datos!D218,\"\")))","v":""},{"$f":"IF(I56=\"\",\"\",Datos!E218)","v":""}]
[{"$nulls":8},{"$f":"IF(G57=\"\",\"\",IF(G57=Datos!$H$186,0,IF(ISNUMBER(Datos!D219),Datos!D219,\"\")))","v":""},{"$f":"IF(I57=\"\",\"\",Datos!E219)","v":""}]
[{"$nulls":8},{"$f":"IF(G58=\"\",\"\",IF(G58=Datos!$H$186,0,IF(ISNUMBER(Datos!D220),Datos!D220,\"\")))","v":""},{"$f":"IF(I58=\"\",\"\",Datos!E220)","v":""}]
[{"$nulls":8},{"$f":"IF(G59=\"\",\"\",IF(G59=Datos!$H$186,0,IF(ISNUMBER(Datos!D221),Datos!D221,\"\")))","v":""},{"$f":"IF(I59=\"\",\"\",Datos!E221)","v":""}]
[{"$nulls":8},{"$f":"IF(G60=\"\",\"\",IF(G60=Datos!$H$186,0,IF(ISNUMBER(Datos!D222),Datos!D222,\"\")))","v":""},{"$f":"IF(I60=\"\",\"\",Datos!E222)","v":""}]
[{"$nulls":8},{"$f":"IF(G61=\"\",\"\",IF(G61=Datos!$H$186,0,IF(ISNUMBER(Datos!D223),Datos!D223,\"\")))","v":""},{"$f":"IF(I61=\"\",\"\",Datos!E223)","v":""}]
[{"$nulls":8},{"$f":"IF(G62=\"\",\"\",IF(G62=Datos!$H$186,0,IF(ISNUMBER(Datos!D224),Datos!D224,\"\")))","v":""},{"$f":"IF(I62=\"\",\"\",Datos!E224)","v":""}]
[{"$nulls":8},{"$f":"IF(G63=\"\",\"\",IF(G63=Datos!$H$186,0,IF(ISNUMBER(Datos!D225),Datos!D225,\"\")))","v":""},{"$f":"IF(I63=\"\",\"\",Datos!E225)","v":""}]
[{"$nulls":8},{"$f":"IF(G64=\"\",\"\",IF(G64=Datos!$H$186,0,IF(ISNUMBER(Datos!D226),Datos!D226,\"\")))","v":""},{"$f":"IF(I64=\"\",\"\",Datos!E226)","v":""}]
[{"$nulls":8},{"$f":"IF(G65=\"\",\"\",IF(G65=Datos!$H$186,0,IF(ISNUMBER(Datos!D227),Datos!D227,\"\")))","v":""},{"$f":"IF(I65=\"\",\"\",Datos!E227)","v":""}]
[{"$nulls":8},{"$f":"IF(G66=\"\",\"\",IF(G66=Datos!$H$186,0,IF(ISNUMBER(Datos!D228),Datos!D228,\"\")))","v":""},{"$f":"IF(I66=\"\",\"\",Datos!E228)","v":""}]
[{"$nulls":8},{"$f":"IF(G67=\"\",\"\",IF(G67=Datos!$H$186,0,IF(ISNUMBER(Datos!D229),Datos!D229,\"\")))","v":""},{"$f":"IF(I67=\"\",\"\",Datos!E229)","v":""}]
[{"$nulls":8},{"$f":"IF(G68=\"\",\"\",IF(G68=Datos!$H$186,0,IF(ISNUMBER(Datos!D230),Datos!D230,\"\")))","v":""},{"$f":"IF(I68=\"\",\"\",Datos!E230)","v":""}]
{"$rows_empty":25}
[{"$nulls":5},"En caso de que la empresa disponga de GdO de la electricidad, el AHORRO de emisiones estimado en relación al mix eléctrico español para el año 2012, asciende a:"]
[]
[{"$nulls":5},"Estimación del ahorro de emisiones por la contratación de GdO (kg CO2eq)",{"$nulls":4},{"$f":"SUM(IF(G20=#REF!,#REF!*$Q$19,0)+IF(G21=#REF!,#REF!*$Q$19,0)+IF(G22=#REF!,#REF!*$Q$19,0)+IF(G37=#REF!,#REF!*$Q$19,0))","v":{"$error":"#REF!"}}]

{"sheet":"5_Información adicional","index":5,"n_rows":21,"n_cols":10,"rows_kept":21,"merged":[[0,2,0,11],[2,3,3,10],[5,4,5,7],[5,8,8,8],[6,4,8,4],[6,5,8,5],[6,6,8,6],[6,7,8,7],[17,4,17,7],[17,8,19,8],[18,4,19,4],[18,5,19,5],[18,6,19,6],[18,7,19,7]]}
[null,null,"                                          INFORMACIÓN ADICIONAL - INSTALACIONES PROPIAS DE ENERGÍA RENOVABLE"]
[]
["1. Datos de la organización",null,null,"Cumplimentar de manera adicional en caso de que la organización disponga de instalaciones para la generación de energía renovable (paneles fotovoltaicos, turbinas de viento, calderas de biomasa, etc.) ya sea para su venta o para autoconsumo."]
["2. HC Alcance 1: Comb. fósiles"]
["3. HC Alcance 1: Fugas fluorados"]
["4. HC 2: Electricidad",{"$nulls":3},"ENERGÍAS RENOVABLES",{"$nulls":3},"Emisiones\n(kg CO2)"]
["5. Inf. adicional: renovables",{"$nulls":3},"Edificio / Sede (1)","Tipo de Energía Renovable","Energía consumida / vendida (kWh)","Cantidad total\n(kWh)"]
["6. Informe final: Resultados"]
["7. Factores de emisión, PCG, mix"]
["8. Ayuda: observaciones",{"$nulls":6},{"$f":"SUM(G10:G14)","v":{"v":0,"d":"0.0"}},{"v":0,"d":"0.00"}]
["9. Consumos. Hoja de trabajo"]
[]
[]
[]
[]
[{"$nulls":3},"En caso de utilizar biomasa como combustible, cumplimentar el siguiente cuadro:",{"$nulls":5}," "]
[]
[{"$nulls":4},"ENERGÍAS RENOVABLES: BIOMASA",{"$nulls":3},"Emisiones\n(kg CO2)"]
[{"$nulls":4},"Edificio / Sede (2)","Tipo de \nbiomasa","Cantidades parciales\n(kg)","Cantidad total \n(kg)"]
[]
[{"$nulls":7},{"$f":"SUM(G21:G26)","v":{"v":0,"d":"0.0"}},{"v":0,"d":"0.00"}]

{"sheet":"6_Resultados","index":6,"n_rows":168,"n_cols":19,"rows_kept":168,"merged":[[0,2,0,20],[2,4,2,5],[2,6,2,18],[3,0,4,0],[4,4,5,5],[4,6,5,18],[5,0,6,0],[7,0,8,0],[7,3,8,20],[9,0,10,0],[10,4,11,5],[10,6,11,6],[10,12,11,15],[10,16,11,17],[10,18,11,19],[11,0,12,0],[13,4,15,4],[13,5,13,6],[13,7,13,8],[13,9,13,10],[14,5,14,6],[14,7,14,8],[14,9,14,10],[15,5,15,6],[15,7,15,8],[15,9,15,10],[16,4,16,6],[16,7,16,8],[16,9,16,10],[18,5,18,6],[18,7,18,8],[18,9,18,10],[20,4,20,6],[20,7,20,8],[20,9,20,10],[21,4,21,10],[22,3,22,20],[26,4,28,4],[53,14,54,14],[53,15,54,16],[56,3,56,20],[59,4,59,9],[59,12,59,17],[61,4,62,4],[61,5,61,6],[61,12,62,12],[61,13,61,14],[62,5,62,6],[62,13,62,14],[63,4,63,6],[63,12,63,14],[65,5,65,6],[65,13,65,14],[67,5,67,6],[67,13,67,14],[69,4,69,9],[69,12,69,17],[71,4,72,4],[71,5,71,6],[71,12,72,12],[71,13,71,14],[72,5,72,6],[72,13,72,14],[73,4,73,6],[73,12,73,14],[75,5,75,6],[75,13,75,14],[77,5,77,6],[77,13,77,14],[79,4,79,9],[79,12,79,17],[81,4,82,4],[81,5,81,6],[81,12,82,12],[81,13,81,14],[82,5,82,6],[82,13,82,14],[83,4,83,6],[83,12,83,14],[85,5,85,6],[85,13,85,14],[87,5,87,6],[87,13,87,14],[89,4,89,9],[89,12,89,17],[91,4,92,4],[91,5,91,6],[91,12,92,12],[91,13,91,14],[92,5,92,6],[92,13,92,14],[93,4,93,6],[93,12,93,14],[95,5,95,6],[95,13,95,14],[97,5,97,6],[97,13,97,14],[99,4,99,9],[99,12,99,17],[101,4,102,4],[101,5,101,6],[101,12,102,12],[101,13,101,14],[102,5,102,6],[102,13,102,14],[103,4,103,6],[103,12,103,14],[105,5,105,6],[105,13,105,14],[107,5,107,6],[107,13,107,14],[109,4,109,9],[109,12,109,17],[111,4,112,4],[111,5,111,6],[111,12,112,12],[111,13,111,14],[112,5,112,6],[112,13,112,14],[113,4,113,6],[113,12,113,14],[115,5,115,6],[115,13,115,14],[117,5,117,6],[117,13,117,14],[119,4,119,9],[119,12,119,17],[121,4,122,4],[121,5,121,6],[121,12,122,12],[121,13,121,14],[122,5,122,6],[122,13,122,14],[123,4,123,6],[123,12,123,14],[125,5,125,6],[125,13,125,14],[127,5,127,6],[127,13,127,14],[129,4,129,9],[129,12,129,17],[131,4,132,4],[131,5,131,6],[131,12,132,12],[131,13,131,14],[132,5,132,6],[132,13,132,14],[133,4,133,6],[133,12,133,14],[135,5,135,6],[135,13,135,14],[137,5,137,6],[137,13,137,14],[139,4,139,9],[139,12,139,17],[141,4,142,4],[141,5,141,6],[141,12,142,12],[141,13,141,14],[142,5,142,6],[142,13,142,14],[143,4,143,6],[143,12,143,14],[145,5,145,6],[145,13,145,14],[147,5,147,6],[147,13,147,14],[149,4,149,9],[149,12,149,17],[151,4,152,4],[151,5,151,6],[151,12,152,12],[151,13,151,14],[152,5,152,6],[152,13,152,14],[153,4,153,6],[153,12,153,14],[155,5,155,6],[155,13,155,14],[157,5,157,6],[157,13,157,14],[159,4,159,9],[159,12,159,17],[161,4,162,4],[161,5,161,6],[161,12,162,12],[161,13,161,14],[162,5,162,6],[162,13,162,14],[163,4,163,6],[163,12,163,14],[165,5,165,6],[165,13,165,14],[167,5,167,6],[167,13,167,14]]}
[null,null,"                                          INFORME FINAL: RESULTADOS"]
[]
["1. Datos de la organización",{"$nulls":3},"Nombre de la organización",null,{"$f":"IF(ISTEXT(Datos!$E$241),Datos!$E$241,\"\")","v":""}]
["2. HC Alcance 1: Comb. fósiles"]
[{"$nulls":4},"Sector de actividad",null,{"$f":"IF(ISTEXT(Datos!$E$242),Datos!$E$242,\"\")","v":""}]
["3. HC Alcance 1: Fugas fluorados"]
[]
["4. HC 2: Electricidad",null,null,"RESULTADOS ABSOLUTOS AÑO DE CÁLCULO"]
[]
["5. Inf. adicional: renovables"]
[{"$nulls":4},"Año  de cálculo",null,{"$f":"IF(ISNUMBER('1_Datos generales organización'!G3),'1_Datos generales organización'!G3,\"\")","v":""},{"$nulls":5},"Huella de carbono de alcance 1+2 del año de cálculo",{"$nulls":3},{"$f":"IF(ISNUMBER(H21),H21,\"\")","v":{"v":0,"d":"0.0000"}},null,"t CO2 eq"]
["6. Informe final: Resultados"]
[]
["7. Factores de emisión, PCG, mix",{"$nulls":3},"ALCANCE 1","Instalaciones fijas",null,{"$f":"IF(ISNUMBER(Datos!T87),(Datos!T87)/1000,0)","v":{"v":0,"d":"0.0000"}},null,"t CO2"]
["8. Ayuda: observaciones",{"$nulls":4},"Desplazamientos en vehículos*",null,{"$f":"IF(ISNUMBER(Datos!T115),(Datos!T115)/1000,0)","v":{"v":0,"d":"0.0000"}},null,"t CO2"]
["9. Consumos. Hoja de trabajo",{"$nulls":4},"Refrigeración/climatización",null,{"$f":"IF(ISNUMBER(Datos!T138),(Datos!T138/1000),0)","v":{"v":0,"d":"0.0000"}},null,"t CO2eq"]
[{"$nulls":4},"TOTAL ALCANCE 1",null,null,{"$f":"SUM(H14:I16)","v":{"v":0,"d":"0.0000"}},null,"t CO2eq"]
[]
[{"$nulls":4},"ALCANCE 2","Electricidad",null,{"$f":"IF(ISNUMBER(Datos!AG186),(Datos!AG186)/1000,0)","v":{"v":0,"d":"0.0000"}},null,"t CO2"]
[]
[{"$nulls":4},"ALCANCE 1+2",null,null,{"$f":"IF(ISNUMBER(SUM(H14+H15+H16+H19)),SUM(H14+H15+H16+H19),\"\")","v":{"v":0,"d":"0.0000"}},null,"t CO2eq"]
[{"$nulls":4},"* Se excluye el transporte a través de vehículos propulsados por electricidad que se incluye en alcance 2."]
[{"$nulls":3},"RESULTADOS RELATIVOS PARA ALCANCE 1+2 - EVOLUCIÓN"]
[]
[]
[{"$nulls":6},{"$f":"IF(ISNUMBER(Datos!G268),Datos!G268,\"\")","v":""}," t CO2eq /",{"$f":"IF(ISTEXT('1_Datos generales organización'!L27),'1_Datos generales organización'!L27,\"\")","v":""}]
[{"$nulls":4},"AÑO DE\n CÁLCULO:    "]
[{"$nulls":5},{"$f":"IF(ISNUMBER(Datos!$G$266),Datos!$G$248,\"\")","v":""},{"$f":"IF(ISNUMBER(Datos!G269),Datos!G269,\"\")","v":""},"t CO2eq /","m2"]
[]
[{"$nulls":6},{"$f":"IF(ISNUMBER(Datos!G270),Datos!G270,\"\")","v":""},"t CO2eq /","empleado"]
[]
[]
[]
[{"$nulls":6},{"$f":"IF(ISNUMBER(Datos!D268),Datos!D268,\"\")","v":""},"t CO2eq /",{"$f":"IF(ISTEXT(I26),I26,\"\")","v":""}]
[]
[{"$nulls":4},"AÑO 1:",{"$f":"IF(ISNUMBER(Datos!$D$266),Datos!$D$266,\"\")","v":""},{"$f":"IF(ISNUMBER(Datos!D269),Datos!D269,\"\")","v":""},"t CO2eq /","m2"]
[]
[{"$nulls":6},{"$f":"IF(ISNUMBER(Datos!D270),Datos!D270,\"\")","v":""},"t CO2eq /","empleado"]
[]
[]
[]
[{"$nulls":6},{"$f":"IF(ISNUMBER(Datos!E268),Datos!E268,\"\")","v":""},"t CO2eq /",{"$f":"IF(ISTEXT(I26),I26,\"\")","v":""}]
[]
[{"$nulls":4},"AÑO 2:",{"$f":"IF(ISNUMBER(Datos!E266),Datos!E266,\"\")","v":""},{"$f":"IF(ISNUMBER(Datos!E269),Datos!E269,\"\")","v":""},"t CO2eq /","m2"]
[]
[{"$nulls":6},{"$f":"IF(ISNUMBER(Datos!E270),Datos!E270,\"\")","v":""},"t CO2eq /","empleado"]
[]
[]
[]
[{"$nulls":6},{"$f":"IF(ISNUMBER(Datos!F268),Datos!F268,\"\")","v":""},"t CO2eq /",{"$f":"IF(ISTEXT(I26),I26,\"\")","v":""},{"$nulls":8},{"$f":"Datos!$D$274-Datos!$D$273","v":{"$error":"#DIV/0!"}}]
[]
[{"$nulls":4},"AÑO 3:",{"$f":"IF(ISNUMBER(Datos!$F$248),Datos!$F$248,\"\")","v":""},{"$f":"IF(ISNUMBER(Datos!F269),Datos!F269,\"\")","v":""},"t CO2eq /","m2"]
[]
[{"$nulls":6},{"$f":"IF(ISNUMBER(Datos!F270),Datos!F270,\"\")","v":""},"t CO2eq /","empleado",{"$nulls":5},{"$f":"Datos!F274","v":"Incremento de"},{"$f":"IF(ISNUMBER(Datos!D275),Datos!D275,Datos!D276)","v":{"$error":"#DIV/0!"}}]
[]
[]
[{"$nulls":3},"RESULTADOS POR EDIFICIO / SEDE *"]
[{"$nulls":3},"* Se excluyen las emisiones de los vehículos por la complejidad en muchos casos de asignarlos a una sede u otra."]
[{"$nulls":4},"edificio",{"$nulls":7},"Edificio"]
[{"$nulls":4},{"$f":"Datos!E286","v":{"$error":"#N/A"}},{"$nulls":7},{"$f":"Datos!E287","v":{"$error":"#N/A"}}]
[]
[{"$nulls":4},"ALCANCE 1","Instalaciones fijas",null,{"$f":"DSUM('2_Combustibles fósiles'!$E$17:$J$39,\"emisiones\",'6_Resultados'!E59:J60)/1000","v":{"v":0,"d":"0.00"}},"t CO₂",{"$nulls":3},"ALCANCE 1","Instalaciones fijas",null,{"$f":"DSUM('2_Combustibles fósiles'!$E$17:$J$39,\"emisiones\",'6_Resultados'!M59:R60)/1000","v":{"v":0,"d":"0.00"}},"t CO₂"]
[{"$nulls":5},"Refrigeración/climatización",null,{"$f":"DSUM('3_Fluorados'!$E$11:$N$33,\"emisiones\",'6_Resultados'!E59:J60)/1000","v":{"v":0,"d":"0.00"}},"t CO₂eq",{"$nulls":4},"Refrigeración / climatización",null,{"$f":"DSUM('3_Fluorados'!$E$11:$N$33,\"emisiones\",'6_Resultados'!M59:S60)/1000","v":{"v":0,"d":"0.00"}},"t CO₂eq"]
[{"$nulls":4},"TOTAL ALCANCE 1",null,null,{"$f":"SUM(H62:H63)","v":{"v":0,"d":"0.00"}},"t CO₂eq",{"$nulls":3},"TOTAL ALCANCE 1",null,null,{"$f":"SUM(P62:S63)","v":{"v":0,"d":"0.00"}},"t CO₂eq"]
[]
[{"$nulls":4},"ALCANCE 2","Electricidad",null,{"$f":"DSUM('4_Electricidad'!$E$19:$J$41,\"emisiones\",'6_Resultados'!E59:J60)/1000","v":{"v":0,"d":"0.00"}},"t CO₂",{"$nulls":3},"ALCANCE 2","Electricidad",null,{"$f":"DSUM('4_Electricidad'!$E$19:$J$41,\"emisiones\",'6_Resultados'!M59:S60)/1000","v":{"v":0,"d":"0.00"}},"t CO₂"]
[]
[{"$nulls":4},"ALCANCE 1+2",null,null,{"$f":"IF(ISNUMBER(SUM(H64+H66)),SUM(SUM(H66+H64)),\"\")","v":{"v":0,"d":"0.00"}},"t CO₂eq",{"$nulls":3},"ALCANCE 1+2",null,null,{"$f":"IF(ISNUMBER(SUM(P64+P66)),SUM(SUM(P66+P64)),\"\")","v":{"v":0,"d":"0.00"}},"t CO₂eq"]
[{"$nulls":4},"Edificio",{"$nulls":7},"Edificio"]
[{"$nulls":4},{"$f":"Datos!E288","v":{"$error":"#N/A"}},{"$nulls":7},{"$f":"Datos!E289","v":{"$error":"#N/A"}}]
[]
[{"$nulls":4},"ALCANCE 1","Instalaciones fijas",null,{"$f":"DSUM('2_Combustibles fósiles'!$E$17:$J$39,\"emisiones\",'6_Resultados'!E69:J70)/1000","v":{"v":0,"d":"0.00"}},"t CO₂",{"$nulls":3},"ALCANCE 1","Instalaciones fijas",null,{"$f":"DSUM('2_Combustibles fósiles'!$E$17:$J$39,\"emisiones\",'6_Resultados'!M69:S70)/1000","v":{"v":0,"d":"0.00"}},"t CO₂"]
[{"$nulls":5},"Refrigeración/climatización",null,{"$f":"DSUM('3_Fluorados'!$E$11:$N$33,\"emisiones\",'6_Resultados'!E69:J70)/1000","v":{"v":0,"d":"0.00"}},"t CO₂eq",{"$nulls":4},"Refrigeración / climatización",null,{"$f":"DSUM('3_Fluorados'!$E$11:$N$33,\"emisiones\",'6_Resultados'!M69:S70)/1000","v":{"v":0,"d":"0.00"}},"t CO₂eq"]
[{"$nulls":4},"TOTAL ALCANCE 1",null,null,{"$f":"SUM(H72:H73)","v":{"v":0,"d":"0.00"}},"t CO₂eq",{"$nulls":3},"TOTAL ALCANCE 1",null,null,{"$f":"SUM(P72:S73)","v":{"v":0,"d":"0.00"}},"t CO₂eq"]
[]
[{"$nulls":4},"ALCANCE 2","Electricidad",null,{"$f":"DSUM('4_Electricidad'!$E$19:$J$41,\"emisiones\",'6_Resultados'!E69:J70)/1000","v":{"v":0,"d":"0.00"}},"t CO₂",{"$nulls":3},"ALCANCE 2","Electricidad",null,{"$f":"DSUM('4_Electricidad'!$E$19:$J$41,\"emisiones\",'6_Resultados'!M69:S70)/1000","v":{"v":0,"d":"0.00"}},"t CO₂"]
[]
[{"$nulls":4},"ALCANCE 1+2",null,null,{"$f":"IF(ISNUMBER(SUM(H74+H76)),SUM(SUM(H76+H74)),\"\")","v":{"v":0,"d":"0.00"}},"t CO₂eq",{"$nulls":3},"ALCANCE 1+2",null,null,{"$f":"IF(ISNUMBER(SUM(P74+P76)),SUM(SUM(P76+P74)),\"\")","v":{"v":0,"d":"0.00"}},"t CO₂eq"]
[{"$nulls":4},"Edificio",{"$nulls":7},"Edificio"]
[{"$nulls":4},{"$f":"Datos!E290","v":{"$error":"#N/A"}},{"$nulls":7},{"$f":"Datos!E291","v":{"$error":"#N/A"}}]
[{"$nulls":4},{"$f":"E80","v":{"$error":"#N/A"}}]
[{"$nulls":4},"ALCANCE 1","Instalaciones fijas",null,{"$f":"DSUM('2_Combustibles fósiles'!$E$17:$J$39,\"emisiones\",'6_Resultados'!E79:J80)/1000","v":{"v":0,"d":"0.00"}},"t CO₂",{"$nulls":3},"ALCANCE 1","Instalaciones fijas",null,{"$f":"DSUM('2_Combustibles fósiles'!$E$17:$J$39,\"emisiones\",'6_Resultados'!M79:S80)/1000","v":{"v":0,"d":"0.00"}},"t CO₂"]
[{"$nulls":5},"Refrigeración/climatización",null,{"$f":"DSUM('3_Fluorados'!$E$11:$N$33,\"emisiones\",'6_Resultados'!E79:J80)/1000","v":{"v":0,"d":"0.00"}},"t CO₂eq",{"$nulls":4},"Refrigeración / climatización",null,{"$f":"DSUM('3_Fluorados'!$E$11:$N$33,\"emisiones\",'6_Resultados'!M79:S80)/1000","v":{"v":0,"d":"0.00"}},"t CO₂eq"]
[{"$nulls":4},"TOTAL ALCANCE 1",null,null,{"$f":"SUM(H82:H83)","v":{"v":0,"d":"0.00"}},"t CO₂eq",{"$nulls":3},"TOTAL ALCANCE 1",null,null,{"$f":"SUM(P82:S83)","v":{"v":0,"d":"0.00"}},"t CO₂eq"]
[]
[{"$nulls":4},"ALCANCE 2","Electricidad",null,{"$f":"DSUM('4_Electricidad'!$E$19:$J$41,\"emisiones\",'6_Resultados'!E79:J80)/1000","v":{"v":0,"d":"0.00"}},"t CO₂",{"$nulls":3},"ALCANCE 2","Electricidad",null,{"$f":"DSUM('4_Electricidad'!$E$19:$J$41,\"emisiones\",'6_Resultados'!M79:S80)/1000","v":{"v":0,"d":"0.00"}},"t CO₂"]
[]
[{"$nulls":4},"ALCANCE 1+2",null,null,{"$f":"IF(ISNUMBER(SUM(H84+H86)),SUM(SUM(H86+H84)),\"\")","v":{"v":0,"d":"0.00"}},"t CO₂eq",{"$nulls":3},"ALCANCE 1+2",null,null,{"$f":"IF(ISNUMBER(SUM(P84+P86)),SUM(SUM(P86+P84)),\"\")","v":{"v":0,"d":"0.00"}},"t CO₂eq"]
[{"$nulls":4},"Edificio",{"$nulls":7},"Edificio"]
[{"$nulls":4},{"$f":"Datos!E292","v":{"$error":"#N/A"}},{"$nulls":7},{"$f":"Datos!E293","v":{"$error":"#N/A"}}]
[]
[{"$nulls":4},"ALCANCE 1","Instalaciones fijas",null,{"$f":"DSUM('2_Combustibles fósiles'!$E$17:$J$39,\"emisiones\",'6_Resultados'!E89:J90)/1000","v":{"v":0,"d":"0.00"}},"t CO₂",{"$nulls":3},"ALCANCE 1","Instalaciones fijas",null,{"$f":"DSUM('2_Combustibles fósiles'!$E$17:$J$39,\"emisiones\",'6_Resultados'!M89:S90)/1000","v":{"v":0,"d":"0.00"}},"t CO₂"]
[{"$nulls":5},"Refrigeración / climatización",null,{"$f":"DSUM('3_Fluorados'!$E$11:$N$33,\"emisiones\",'6_Resultados'!E89:J90)/1000","v":{"v":0,"d":"0.00"}},"t CO₂eq",{"$nulls":4},"Refrigeración / climatización",null,{"$f":"DSUM('3_Fluorados'!$E$11:$N$33,\"emisiones\",'6_Resultados'!M89:S90)/1000","v":{"v":0,"d":"0.00"}},"t CO₂eq"]
[{"$nulls":4},"TOTAL ALCANCE 1",null,null,{"$f":"SUM(H92:H93)","v":{"v":0,"d":"0.00"}},"t CO₂eq",{"$nulls":3},"TOTAL ALCANCE 1",null,null,{"$f":"SUM(P92:S93)","v":{"v":0,"d":"0.00"}},"t CO₂eq"]
[]
[{"$nulls":4},"ALCANCE 2","Electricidad",null,{"$f":"DSUM('4_Electricidad'!$E$19:$J$41,\"emisiones\",'6_Resultados'!E89:J90)/1000","v":{"v":0,"d":"0.00"}},"t CO₂",{"$nulls":3},"ALCANCE 2","Electricidad",null,{"$f":"DSUM('4_Electricidad'!$E$19:$J$41,\"emisiones\",'6_Resultados'!M89:S90)/1000","v":{"v":0,"d":"0.00"}},"t CO₂"]
[]
[{"$nulls":4},"ALCANCE 1+2",null,null,{"$f":"IF(ISNUMBER(SUM(H94+H96)),SUM(SUM(H96+H94)),\"\")","v":{"v":0,"d":"0.00"}}," t CO₂eq",{"$nulls":3},"ALCANCE 1+2",null,null,{"$f":"IF(ISNUMBER(SUM(P94+P96)),SUM(SUM(P96+P94)),\"\")","v":{"v":0,"d":"0.00"}},"t CO₂eq"]
[{"$nulls":4},"Edificio",{"$nulls":7},"Edificio"]
[{"$nulls":4},{"$f":"Datos!E294","v":{"$error":"#N/A"}},{"$nulls":7},{"$f":"Datos!E295","v":{"$error":"#N/A"}}]
[]
[{"$nulls":4},"ALCANCE 1","Instalaciones fijas",null,{"$f":"DSUM('2_Combustibles fósiles'!$E$17:$J$39,\"emisiones\",'6_Resultados'!E99:J100)/1000","v":{"v":0,"d":"0.00"}},"t CO₂",{"$nulls":3},"ALCANCE 1","Instalaciones fijas",null,{"$f":"DSUM('2_Combustibles fósiles'!$E$17:$J$39,\"emisiones\",'6_Resultados'!M99:S100)/1000","v":{"v":0,"d":"0.00"}},"t CO₂"]
[{"$nulls":5},"Refrigeración / climatización",null,{"$f":"DSUM('3_Fluorados'!$E$11:$N$33,\"emisiones\",'6_Resultados'!E99:J100)/1000","v":{"v":0,"d":"0.00"}},"t CO₂eq",{"$nulls":4},"Refrigeración / climatización",null,{"$f":"DSUM('3_Fluorados'!$E$11:$N$33,\"emisiones\",'6_Resultados'!M99:S100)/1000","v":{"v":0,"d":"0.00"}},"t CO₂eq"]
[{"$nulls":4},"TOTAL ALCANCE 1",null,null,{"$f":"SUM(H102:H103)","v":{"v":0,"d":"0.00"}},"t CO₂eq",{"$nulls":3},"TOTAL ALCANCE 1",null,null,{"$f":"SUM(P102:S103)","v":{"v":0,"d":"0.00"}},"t CO₂eq"]
[]
[{"$nulls":4},"ALCANCE 2","Electricidad",null,{"$f":"DSUM('4_Electricidad'!$E$19:$J$41,\"emisiones\",'6_Resultados'!E99:J100)/1000","v":{"v":0,"d":"0.00"}},"t CO₂",{"$nulls":3},"ALCANCE 2","Electricidad",null,{"$f":"DSUM('4_Electricidad'!$E$19:$J$41,\"emisiones\",'6_Resultados'!M99:S100)/1000","v":{"v":0,"d":"0.00"}},"t CO₂"]
[]
[{"$nulls":4},"ALCANCE 1+2",null,null,{"$f":"IF(ISNUMBER(SUM(H104+H106)),SUM(SUM(H106+H104)),\"\")","v":{"v":0,"d":"0.00"}},"t CO₂eq",{"$nulls":3},"ALCANCE 1+2",null,null,{"$f":"IF(ISNUMBER(SUM(P104+P106)),SUM(SUM(P106+P104)),\"\")","v":{"v":0,"d":"0.00"}},"t CO₂eq"]
[{"$nulls":4},"Edificio",{"$nulls":7},"Edificio"]
[{"$nulls":4},{"$f":"Datos!E296","v":{"$error":"#N/A"}},{"$nulls":7},{"$f":"Datos!E297","v":{"$error":"#N/A"}}]
[]
[{"$nulls":4},"ALCANCE 1","Instalaciones fijas",null,{"$f":"DSUM('2_Combustibles fósiles'!$E$17:$J$39,\"emisiones\",'6_Resultados'!E109:J110)/1000","v":{"v":0,"d":"0.00"}},"t CO₂",{"$nulls":3},"ALCANCE 1","Instalaciones fijas",null,{"$f":"DSUM('2_Combustibles fósiles'!$E$17:$J$39,\"emisiones\",'6_Resultados'!M109:S110)/1000","v":{"v":0,"d":"0.00"}},"t CO₂"]
[{"$nulls":5},"Refrigeración / climatización",null,{"$f":"DSUM('3_Fluorados'!$E$11:$N$33,\"emisiones\",'6_Resultados'!E109:J110)/1000","v":{"v":0,"d":"0.00"}},"t CO₂eq",{"$nulls":4},"Refrigeración / climatización",null,{"$f":"DSUM('3_Fluorados'!$E$11:$N$33,\"emisiones\",'6_Resultados'!M109:S110)/1000","v":{"v":0,"d":"0.00"}},"t CO₂eq"]
[{"$nulls":4},"TOTAL ALCANCE 1",null,null,{"$f":"SUM(H112:H113)","v":{"v":0,"d":"0.00"}},"t CO₂eq",{"$nulls":3},"TOTAL ALCANCE 1",null,null,{"$f":"SUM(P112:S113)","v":{"v":0,"d":"0.00"}},"t CO₂eq"]
[]
[{"$nulls":4},"ALCANCE 2","Electricidad",null,{"$f":"DSUM('4_Electricidad'!$E$19:$J$41,\"emisiones\",'6_Resultados'!E109:J110)/1000","v":{"v":0,"d":"0.00"}},"t CO₂",{"$nulls":3},"ALCANCE 2","Electricidad",null,{"$f":"DSUM('4_Electricidad'!$E$19:$J$41,\"emisiones\",'6_Resultados'!M109:S110)/1000","v":{"v":0,"d":"0.00"}},"t CO₂"]
[]
[{"$nulls":4},"ALCANCE 1+2",null,null,{"$f":"IF(ISNUMBER(SUM(H114+H116)),SUM(SUM(H116+H114)),\"\")","v":{"v":0,"d":"0.00"}},"t CO₂eq",{"$nulls":3},"ALCANCE 1+2",null,null,{"$f":"IF(ISNUMBER(SUM(P114+P116)),SUM(SUM(P116+P114)),\"\")","v":{"v":0,"d":"0.00"}},"t CO₂eq"]
[{"$nulls":4},"Edificio",{"$nulls":7},"Edificio"]
[{"$nulls":4},{"$f":"Datos!E298","v":{"$error":"#N/A"}},{"$nulls":7},{"$f":"Datos!E299","v":{"$error":"#N/A"}}]
[]
[{"$nulls":4},"ALCANCE 1","Instalaciones fijas",null,{"$f":"DSUM('2_Combustibles fósiles'!$E$17:$J$39,\"emisiones\",'6_Resultados'!E119:J120)/1000","v":{"v":0,"d":"0.00"}},"t CO₂",{"$nulls":3},"ALCANCE 1","Instalaciones fijas",null,{"$f":"DSUM('2_Combustibles fósiles'!$E$17:$J$39,\"emisiones\",'6_Resultados'!M119:S120)/1000","v":{"v":0,"d":"0.00"}},"t CO₂"]
[{"$nulls":5},"Refrigeración / climatización",null,{"$f":"DSUM('3_Fluorados'!$E$11:$N$33,\"emisiones\",'6_Resultados'!E119:J120)/1000","v":{"v":0,"d":"0.00"}},"t CO₂eq",{"$nulls":4},"Refrigeración / climatización",null,{"$f":"DSUM('3_Fluorados'!$E$11:$N$33,\"emisiones\",'6_Resultados'!M119:S120)/1000","v":{"v":0,"d":"0.00"}},"t CO₂eq"]
[{"$nulls":4},"TOTAL ALCANCE 1",null,null,{"$f":"SUM(H122:H123)","v":{"v":0,"d":"0.00"}},"t CO₂eq",{"$nulls":3},"TOTAL ALCANCE 1",null,null,{"$f":"SUM(P122:S123)","v":{"v":0,"d":"0.00"}},"t CO₂eq"]
[]
[{"$nulls":4},"ALCANCE 2","Electricidad",null,{"$f":"DSUM('4_Electricidad'!$E$19:$J$41,\"emisiones\",'6_Resultados'!E119:J120)/1000","v":{"v":0,"d":"0.00"}},"t CO₂",{"$nulls":3},"ALCANCE 2","Electricidad",null,{"$f":"DSUM('4_Electricidad'!$E$19:$J$41,\"emisiones\",'6_Resultados'!M119:S120)/1000","v":{"v":0,"d":"0.00"}},"t CO₂"]
[]
[{"$nulls":4},"ALCANCE 1+2",null,null,{"$f":"IF(ISNUMBER(SUM(H124+H126)),SUM(SUM(H126+H124)),\"\")","v":{"v":0,"d":"0.00"}},"t CO₂eq",{"$nulls":3},"ALCANCE 1+2",null,null,{"$f":"IF(ISNUMBER(SUM(P124+P126)),SUM(SUM(P126+P124)),\"\")","v":{"v":0,"d":"0.00"}},"t CO₂eq"]
[{"$nulls":4},"Edificio",{"$nulls":7},"Edificio"]
[{"$nulls":4},{"$f":"Datos!E300","v":{"$error":"#N/A"}},{"$nulls":7},{"$f":"Datos!E301","v":{"$error":"#N/A"}}]
[]
[{"$nulls":4},"ALCANCE 1","Instalaciones fijas",null,{"$f":"DSUM('2_Combustibles fósiles'!$E$17:$J$39,\"emisiones\",'6_Resultados'!E129:J130)/1000","v":{"v":0,"d":"0.00"}},"t CO₂",{"$nulls":3},"ALCANCE 1","Instalaciones fijas",null,{"$f":"DSUM('2_Combustibles fósiles'!$E$17:$J$39,\"emisiones\",'6_Resultados'!M129:S130)/1000","v":{"v":0,"d":"0.00"}},"t CO₂"]
[{"$nulls":5},"Refrigeración / climatización",null,{"$f":"DSUM('3_Fluorados'!$E$11:$N$33,\"emisiones\",'6_Resultados'!E129:J130)/1000","v":{"v":0,"d":"0.00"}},"t CO₂eq",{"$nulls":4},"Refrigeración / climatización",null,{"$f":"DSUM('3_Fluorados'!$E$11:$N$33,\"emisiones\",'6_Resultados'!M129:S130)/1000","v":{"v":0,"d":"0.00"}},"t CO₂eq"]
[{"$nulls":4},"TOTAL ALCANCE 1",null,null,{"$f":"SUM(H132:H133)","v":{"v":0,"d":"0.00"}},"t CO₂eq",{"$nulls":3},"TOTAL ALCANCE 1",null,null,{"$f":"SUM(P132:S133)","v":{"v":0,"d":"0.00"}},"t CO₂eq"]
[]
[{"$nulls":4},"ALCANCE 2","Electricidad",null,{"$f":"DSUM('4_Electricidad'!$E$19:$J$41,\"emisiones\",'6_Resultados'!E129:J130)/1000","v":{"v":0,"d":"0.00"}},"t CO₂",{"$nulls":3},"ALCANCE 2","Electricidad",null,{"$f":"DSUM('4_Electricidad'!$E$19:$J$41,\"emisiones\",'6_Resultados'!M129:S130)/1000","v":{"v":0,"d":"0.00"}},"t CO₂"]
[]
[{"$nulls":4},"ALCANCE 1+2",null,null,{"$f":"IF(ISNUMBER(SUM(H134+H136)),SUM(SUM(H136+H134)),\"\")","v":{"v":0,"d":"0.00"}},"t CO₂eq",{"$nulls":3},"ALCANCE 1+2",null,null,{"$f":"IF(ISNUMBER(SUM(P134+P136)),SUM(SUM(P136+P134)),\"\")","v":{"v":0,"d":"0.00"}},"t CO₂eq"]
[{"$nulls":4},"Edificio",{"$nulls":7},"Edificio"]
[{"$nulls":4},{"$f":"Datos!E302","v":{"$error":"#N/A"}},{"$nulls":7},{"$f":"Datos!E303","v":{"$error":"#N/A"}}]
[]
[{"$nulls":4},"ALCANCE 1","Instalaciones fijas",null,{"$f":"DSUM('2_Combustibles fósiles'!$E$17:$J$39,\"emisiones\",'6_Resultados'!E139:J140)/1000","v":{"v":0,"d":"0.00"}},"t CO₂",{"$nulls":3},"ALCANCE 1","Instalaciones fijas",null,{"$f":"DSUM('2_Combustibles fósiles'!$E$17:$J$39,\"emisiones\",'6_Resultados'!M139:S140)/1000","v":{"v":0,"d":"0.00"}},"t CO₂"]
[{"$nulls":5},"Refrigeración / climatización",null,{"$f":"DSUM('3_Fluorados'!$E$11:$N$33,\"emisiones\",'6_Resultados'!E139:J140)/1000","v":{"v":0,"d":"0.00"}},"t CO₂eq",{"$nulls":4},"Refrigeración / climatización",null,{"$f":"DSUM('3_Fluorados'!$E$11:$N$33,\"emisiones\",'6_Resultados'!M139:S140)/1000","v":{"v":0,"d":"0.00"}},"t CO₂eq"]
[{"$nulls":4},"TOTAL ALCANCE 1",null,null,{"$f":"SUM(H142:H143)","v":{"v":0,"d":"0.00"}},"t CO₂eq",{"$nulls":3},"TOTAL ALCANCE 1",null,null,{"$f":"SUM(P142:S143)","v":{"v":0,"d":"0.00"}},"t CO₂eq"]
[]
[{"$nulls":4},"ALCANCE 2","Electricidad",null,{"$f":"DSUM('4_Electricidad'!$E$19:$J$41,\"emisiones\",'6_Resultados'!E139:J140)/1000","v":{"v":0,"d":"0.00"}},"t CO₂",{"$nulls":3},"ALCANCE 2","Electricidad",null,{"$f":"DSUM('4_Electricidad'!$E$19:$J$41,\"emisiones\",'6_Resultados'!M139:S140)/1000","v":{"v":0,"d":"0.00"}},"t CO₂"]
[]
[{"$nulls":4},"ALCANCE 1+2",null,null,{"$f":"IF(ISNUMBER(SUM(H144+H146)),SUM(SUM(H146+H144)),\"\")","v":{"v":0,"d":"0.00"}},"t CO₂eq",{"$nulls":3},"ALCANCE 1+2",null,null,{"$f":"IF(ISNUMBER(SUM(P144+P146)),SUM(SUM(P146+P144)),\"\")","v":{"v":0,"d":"0.00"}},"t CO₂eq"]
[{"$nulls":4},"Edificio",{"$nulls":7},"Edificio"]
[{"$nulls":4},{"$f":"Datos!E304","v":{"$error":"#N/A"}},{"$nulls":7},{"$f":"Datos!E305","v":{"$error":"#N/A"}}]
[]
[{"$nulls":4},"ALCANCE 1","Instalaciones fijas",null,{"$f":"DSUM('2_Combustibles fósiles'!$E$17:$J$39,\"emisiones\",'6_Resultados'!E149:J150)/1000","v":{"v":0,"d":"0.00"}},"t CO₂",{"$nulls":3},"ALCANCE 1","Instalaciones fijas",null,{"$f":"DSUM('2_Combustibles fósiles'!$E$17:$J$39,\"emisiones\",'6_Resultados'!M149:S150)/1000","v":{"v":0,"d":"0.00"}},"t CO₂"]
[{"$nulls":5},"Refrigeración / climatización",null,{"$f":"DSUM('3_Fluorados'!$E$11:$N$33,\"emisiones\",'6_Resultados'!E149:J150)/1000","v":{"v":0,"d":"0.00"}},"t CO₂eq",{"$nulls":4},"Refrigeración / climatización",null,{"$f":"DSUM('3_Fluorados'!$E$11:$N$33,\"emisiones\",'6_Resultados'!M149:S150)/1000","v":{"v":0,"d":"0.00"}},"t CO₂eq"]
[{"$nulls":4},"TOTAL ALCANCE 1",null,null,{"$f":"SUM(H152:H153)","v":{"v":0,"d":"0.00"}},"t CO₂eq",{"$nulls":3},"TOTAL ALCANCE 1",null,null,{"$f":"SUM(P152:S153)","v":{"v":0,"d":"0.00"}},"t CO₂eq"]
[]
[{"$nulls":4},"ALCANCE 2","Electricidad",null,{"$f":"DSUM('4_Electricidad'!$E$19:$J$41,\"emisiones\",'6_Resultados'!E149:J150)/1000","v":{"v":0,"d":"0.00"}},"t CO₂",{"$nulls":3},"ALCANCE 2","Electricidad",null,{"$f":"DSUM('4_Electricidad'!$E$19:$J$41,\"emisiones\",'6_Resultados'!M149:S150)/1000","v":{"v":0,"d":"0.00"}},"t CO₂"]
[]
[{"$nulls":4},"ALCANCE 1+2",null,null,{"$f":"IF(ISNUMBER(SUM(H154+H156)),SUM(SUM(H156+H154)),\"\")","v":{"v":0,"d":"0.00"}},"t CO₂eq",{"$nulls":3},"ALCANCE 1+2",null,null,{"$f":"IF(ISNUMBER(SUM(P154+P156)),SUM(SUM(P156+P154)),\"\")","v":{"v":0,"d":"0.00"}},"t CO₂eq"]
[{"$nulls":4},"Edificio",{"$nulls":7},"Edificio"]
[{"$nulls":4},{"$f":"Datos!E306","v":{"$error":"#N/A"}},{"$nulls":7},{"$f":"Datos!E307","v":{"$error":"#N/A"}}]
[]
[{"$nulls":4},"ALCANCE 1","Instalaciones fijas",null,{"$f":"DSUM('2_Combustibles fósiles'!$E$17:$J$39,\"emisiones\",'6_Resultados'!E159:J160)/1000","v":{"v":0,"d":"0.00"}},"t CO₂",{"$nulls":3},"ALCANCE 1","Instalaciones fijas",null,{"$f":"DSUM('2_Combustibles fósiles'!$E$17:$J$39,\"emisiones\",'6_Resultados'!M159:S160)/1000","v":{"v":0,"d":"0.00"}},"t CO₂"]
[{"$nulls":5},"Refrigeración / climatización",null,{"$f":"DSUM('3_Fluorados'!$E$11:$N$33,\"emisiones\",'6_Resultados'!E159:J160)/1000","v":{"v":0,"d":"0.00"}},"t CO₂eq",{"$nulls":4},"Refrigeración / climatización",null,{"$f":"DSUM('3_Fluorados'!$E$11:$N$33,\"emisiones\",'6_Resultados'!M159:S160)/1000","v":{"v":0,"d":"0.00"}},"t CO₂eq"]
[{"$nulls":4},"TOTAL ALCANCE 1",null,null,{"$f":"SUM(H162:H163)","v":{"v":0,"d":"0.00"}},"t CO₂eq",{"$nulls":3},"TOTAL ALCANCE 1",null,null,{"$f":"SUM(P162:S163)","v":{"v":0,"d":"0.00"}},"t CO₂eq"]
[]
[{"$nulls":4},"ALCANCE 2","Electricidad",null,{"$f":"DSUM('4_Electricidad'!$E$19:$J$41,\"emisiones\",'6_Resultados'!E159:J160)/1000","v":{"v":0,"d":"0.00"}},"t CO₂",{"$nulls":3},"ALCANCE 2","Electricidad",null,{"$f":"DSUM('4_Electricidad'!$E$19:$J$41,\"emisiones\",'6_Resultados'!M159:S160)/1000","v":{"v":0,"d":"0.00"}},"t CO₂"]
[]
[{"$nulls":4},"ALCANCE 1+2",null,null,{"$f":"IF(ISNUMBER(SUM(H164+H166)),SUM(SUM(H166+H164)),\"\")","v":{"v":0,"d":"0.00"}},"t CO₂eq",{"$nulls":3},"ALCANCE 1+2",null,null,{"$f":"IF(ISNUMBER(SUM(P164+P166)),SUM(SUM(P166+P164)),\"\")","v":{"v":0,"d":"0.00"}},"t CO₂eq"]

{"sheet":"7_Factores de emisión","index":7,"n_rows":732,"n_cols":16,"rows_kept":732,"merged":[[0,2,0,17],[2,3,2,16],[4,4,5,16],[6,5,7,5],[6,6,6,15],[33,5,33,16],[34,5,34,16],[35,5,36,16],[37,5,37,16],[67,4,67,16],[68,4,69,16],[70,4,70,16],[71,4,71,16],[72,4,72,16],[73,4,73,16],[74,4,74,16],[76,4,76,16],[77,4,78,16],[79,4,80,16],[81,4,82,16],[83,4,84,16],[85,4,85,16],[89,9,89,10],[90,10,90,13],[91,10,91,13],[92,10,92,13],[93,10,93,13],[94,10,94,13],[95,10,95,13],[96,10,96,13],[97,10,97,13],[98,10,98,13],[99,10,99,13],[100,10,100,13],[101,10,101,13],[102,10,102,13],[103,10,103,13],[104,10,104,13],[105,10,105,13],[106,10,106,13],[107,10,107,13],[108,10,108,13],[109,10,109,13],[110,10,110,13],[111,10,111,13],[112,10,112,13],[113,10,113,13],[114,10,114,13],[116,4,116,16],[118,3,118,16],[120,4,120,5],[120,9,120,10],[124,4,124,6],[124,9,124,12],[145,4,145,5],[145,9,145,10],[149,4,149,6],[149,9,149,12],[151,4,151,6],[152,4,152,6],[153,4,153,6],[177,4,177,5],[177,9,177,10],[181,4,181,6],[181,9,181,12],[225,4,225,5],[225,9,225,10],[229,4,229,6],[229,9,229,12],[234,4,234,6],[235,4,235,6],[236,4,236,6],[237,4,237,6],[238,4,238,6],[239,4,239,6],[240,4,240,6],[244,4,244,6],[245,4,245,6],[246,4,246,6],[349,4,349,5],[349,9,349,10],[353,4,353,6],[353,9,353,12],[528,4,528,5],[532,4,532,6]]}
[null,null,"                                          FACTORES DE EMISIÓN, PCG Y MIX ELÉCTRICO"]
[]
["1. Datos de la organización",null,null,"FACTORES DE EMISIÓN"]
["2. HC Alcance 1: Comb. fósiles"]
["3. HC Alcance 1: Fugas fluorados",{"$nulls":3},"A continuación se indican los factores de emisión de cada tipo de combustible fósil considerado así como las fuentes de donde se han obtenido. Estos factores se refieren a emisiones de CO2 y no incluyen otros gases de efecto invernadero como el CH4 o el N2O."]
["4. HC 2: Electricidad"]
["5. Inf. adicional: renovables",{"$nulls":4},"Combustible (Unidades FE)","Factores de emisión (FE)"]
["6. Informe final: Resultados",{"$nulls":5},2010,2011,2012,2013,2014,2015,2016,2017,2018,2019]
["7. Factores de emisión, PCG, mix",{"$nulls":4},"Gasolina (kgCO2/l) (1)",2.295,2.205,2.201,2.205,2.205,2.205,2.196,{"v":2.18,"d":"2.180"},2.157,"-"]
["8. Ayuda: observaciones",{"$nulls":4},"Gasóleo A (kgCO2/l) (1)",2.653,2.493,2.467,2.544,2.544,2.544,2.539,{"v":2.52,"d":"2.520"},2.493,"-"]
["9. Consumos. Hoja de trabajo",{"$nulls":4},"Gasóleo B (kgCO2/l) (2)",2.708,2.708,2.708,2.708,2.708,2.708,2.708,2.708,2.708,2.708]
[{"$nulls":5},"Gasóleo C (kgCO2/l)",2.868,2.868,2.868,2.868,2.868,2.868,2.868,2.868,2.868,2.868]
[{"$nulls":5},"E5  (kgCO2/l)",{"v":2.18,"d":"2.180"},{"v":2.18,"d":"2.180"},{"v":2.18,"d":"2.180"},{"v":2.18,"d":"2.180"},{"v":2.18,"d":"2.180"},{"v":2.18,"d":"2.180"},{"v":2.18,"d":"2.180"},{"v":2.18,"d":"2.180"},{"v":2.18,"d":"2.180"},{"v":2.18,"d":"2.180"}]
[{"$nulls":5},"E10  (kgCO2/l)",2.065,2.065,2.065,2.065,2.065,2.065,2.065,2.065,2.065,2.065]
[{"$nulls":5},"E85 (kgCO2/l)",0.344,0.344,0.344,0.344,0.344,0.344,0.344,0.344,0.344,0.344]
[{"$nulls":5},"E100 (kgCO2/l)",{"v":0,"d":"0.000"},{"v":0,"d":"0.000"},{"v":0,"d":"0.000"},{"v":0,"d":"0.000"},{"v":0,"d":"0.000"},{"v":0,"d":"0.000"},{"v":0,"d":"0.000"},{"v":0,"d":"0.000"},{"v":0,"d":"0.000"},{"v":0,"d":"0.000"}]
[{"$nulls":5},"B7 (kgCO2/l)",2.467,2.467,2.467,2.467,2.467,2.467,2.467,2.467,2.467,2.467]
[{"$nulls":5},"B10 (kgCO2/l)",2.387,2.387,2.387,2.387,2.387,2.387,2.387,2.387,2.387,2.387]
[{"$nulls":5},"B20 (kgCO2/l)",2.122,2.122,2.122,2.122,2.122,2.122,2.122,2.122,2.122,2.122]
[{"$nulls":5},"B30 (kgCO2/l)",1.857,1.857,1.857,1.857,1.857,1.857,1.857,1.857,1.857,1.857]
[{"$nulls":5},"B100 (kgCO2/l)",{"v":0,"d":"0.000"},{"v":0,"d":"0.000"},{"v":0,"d":"0.000"},{"v":0,"d":"0.000"},{"v":0,"d":"0.000"},{"v":0,"d":"0.000"},{"v":0,"d":"0.000"},{"v":0,"d":"0.000"},{"v":0,"d":"0.000"},{"v":0,"d":"0.000"}]
[{"$nulls":5},"XTL (kgCO2/l)",{"v":0,"d":"0.000"},{"v":0,"d":"0.000"},{"v":0,"d":"0.000"},{"v":0,"d":"0.000"},{"v":0,"d":"0.000"},{"v":0,"d":"0.000"},{"v":0,"d":"0.000"},{"v":0,"d":"0.000"},{"v":0,"d":"0.000"},{"v":0,"d":"0.000"}]
[{"$nulls":5},"Gas natural (kgCO2/kWh) (3)",0.182,0.182,0.182,0.182,0.182,0.182,0.182,0.183,0.183,0.182]
[{"$nulls":5},"LNG (kgCO2/kWh) (3)",0.182,0.182,0.182,0.182,0.182,0.182,0.182,0.183,0.183,0.182]
[{"$nulls":5},"CNG (kgCO2/kWh) (3)",0.182,0.182,0.182,0.182,0.182,0.182,0.182,0.183,0.183,0.182]
[{"$nulls":5},"LPG (kgCO2/l)",1.671,1.671,1.671,1.671,1.671,1.671,1.671,1.671,1.671,1.671]
[{"$nulls":5},"H2 (kgCO2/kg)",{"v":0,"d":"0.000"},{"v":0,"d":"0.000"},{"v":0,"d":"0.000"},{"v":0,"d":"0.000"},{"v":0,"d":"0.000"},{"v":0,"d":"0.000"},{"v":0,"d":"0.000"},{"v":0,"d":"0.000"},{"v":0,"d":"0.000"},{"v":0,"d":"0.000"}]
[{"$nulls":5},"Gas butano (kgCO2/kg)",2.964,2.964,2.964,2.964,2.964,2.964,2.964,2.964,2.964,2.964]
[{"$nulls":5},"Gas propano (kgCO2/kg)",2.938,2.938,2.938,2.938,2.938,2.938,2.938,2.938,2.938,2.938]
[{"$nulls":5},"Fuelóleo (kgCO2/kg)",3.127,3.127,3.127,3.127,3.127,3.127,3.127,3.127,3.127,3.127]
[{"$nulls":5},"Carbón nacional (kgCO2/kg)",2.299,2.299,2.299,2.299,2.299,2.299,2.006,2.227,2.227,1.914]
[{"$nulls":5},"Carbón de importación (kgCO2/kg)",2.579,2.579,2.579,2.579,2.579,2.579,{"v":2.43,"d":"2.430"},2.444,2.444,2.429]
[{"$nulls":5},"Coque de petróleo (kgCO2/kg)",3.169,3.169,3.169,3.169,3.169,3.169,3.169,3.169,3.169,3.169]
[]
[{"$nulls":5},"(1) A partir del año 2019 los combustibles gasolina y gasóleo de automoción pasan a denominarse por las letras E y B respectivamente añadiendo la proporción de biocombustible que contienen (RD 639/2016)."]
[{"$nulls":5},"(2) Se corrigen los valores del factor de emisión del gasóleo B para toda la serie histórica en base a la densidad especificada en el Real Decreto 1088/2010 y sin aplicar los objetivos obligatorios mínimos de biocarburantes en cómputo anual considerados en el Real Decreto 1085/2015 que afectarían únicamente al gasóleo A."]
[]
[{"$nulls":5},"(3) El factor de emisión del gas natural se expresa en PCS empleando un factor de conversión para el paso de PCS a PCI de 0,901 (Inventario Nacional de Emisiones de España)."]
[]
[{"$nulls":4},"Poder Calorífico Inferior (GJ/t)"]
[]
[{"$nulls":6},2010,2011,2012,2013,2014,2015,2016,2017,2018,2019]
[{"$nulls":5},"Gas natural*",48.59,48.57,48.24,48.28,48.28,47.66,{"v":48,"d":"48.00"},{"v":48,"d":"48.00"},{"v":48,"d":"48.00"},{"v":48.2,"d":"48.20"}]
[{"$nulls":5},"Gasolina",{"v":44.3,"d":"44.30"},{"v":44.3,"d":"44.30"},{"v":44.3,"d":"44.30"},{"v":44.3,"d":"44.30"},{"v":44.3,"d":"44.30"},{"v":44.3,"d":"44.30"},{"v":44.3,"d":"44.30"},{"v":44.3,"d":"44.30"},{"v":44.3,"d":"44.30"},{"v":44.3,"d":"44.30"}]
[{"$nulls":5},"Gasóleo",{"v":43,"d":"43.00"},{"v":43,"d":"43.00"},{"v":43,"d":"43.00"},{"v":43,"d":"43.00"},{"v":43,"d":"43.00"},{"v":43,"d":"43.00"},{"v":43,"d":"43.00"},{"v":43,"d":"43.00"},{"v":43,"d":"43.00"},{"v":43,"d":"43.00"}]
[{"$nulls":5},"Gas butano",44.78,44.78,44.78,44.78,44.78,44.78,44.78,44.78,44.78,44.78]
[{"$nulls":5},"Gas propano",{"v":46.2,"d":"46.20"},{"v":46.2,"d":"46.20"},{"v":46.2,"d":"46.20"},{"v":46.2,"d":"46.20"},{"v":46.2,"d":"46.20"},{"v":46.2,"d":"46.20"},{"v":46.2,"d":"46.20"},{"v":46.2,"d":"46.20"},{"v":46.2,"d":"46.20"},{"v":46.2,"d":"46.20"}]
[{"$nulls":5},"Fuelóleo",{"v":40.4,"d":"40.40"},{"v":40.4,"d":"40.40"},{"v":40.4,"d":"40.40"},{"v":40.4,"d":"40.40"},{"v":40.4,"d":"40.40"},{"v":40.4,"d":"40.40"},{"v":40.4,"d":"40.40"},{"v":40.4,"d":"40.40"},{"v":40.4,"d":"40.40"},{"v":40.4,"d":"40.40"}]
[{"$nulls":5},"GLP genérico",{"v":47.3,"d":"47.30"},{"v":47.3,"d":"47.30"},{"v":47.3,"d":"47.30"},{"v":47.3,"d":"47.30"},{"v":47.3,"d":"47.30"},{"v":47.3,"d":"47.30"},{"v":47.3,"d":"47.30"},{"v":47.3,"d":"47.30"},{"v":47.3,"d":"47.30"},{"v":47.3,"d":"47.30"}]
[{"$nulls":5},"Carbón nacional",23.12,23.12,23.12,23.12,23.12,23.12,20.18,{"v":22.4,"d":"22.40"},{"v":22.4,"d":"22.40"},19.25]
[{"$nulls":5},"Carbón de importación",25.53,25.53,25.53,25.53,25.53,25.53,24.06,{"v":24.2,"d":"24.20"},{"v":24.2,"d":"24.20"},24.05]
[{"$nulls":5},"Coque de petróleo",{"v":32.5,"d":"32.50"},{"v":32.5,"d":"32.50"},{"v":32.5,"d":"32.50"},{"v":32.5,"d":"32.50"},{"v":32.5,"d":"32.50"},{"v":32.5,"d":"32.50"},{"v":32.5,"d":"32.50"},{"v":32.5,"d":"32.50"},{"v":32.5,"d":"32.50"},{"v":32.5,"d":"32.50"}]
[{"$nulls":5},"* Para el paso de PCS a PCI en el gas natural se utiliza el factor de conversión de 0,901."]
[{"$nulls":4},"Factor de emisión de CO2 (kg CO2/GJPCI)"]
[]
[{"$nulls":6},2010,2011,2012,2013,2014,2015,2016,2017,2018,2019]
[{"$nulls":5},"Gas natural",{"v":56.1,"d":"56.10"},{"v":56.1,"d":"56.10"},{"v":56.1,"d":"56.10"},{"v":56.1,"d":"56.10"},{"v":56.1,"d":"56.10"},{"v":56.1,"d":"56.10"},{"v":56.1,"d":"56.10"},{"v":56.4,"d":"56.40"},{"v":56.4,"d":"56.40"},55.98]
[{"$nulls":5},"Gasolina",{"v":69.3,"d":"69.30"},{"v":69.3,"d":"69.30"},{"v":69.3,"d":"69.30"},{"v":69.3,"d":"69.30"},{"v":69.3,"d":"69.30"},{"v":69.3,"d":"69.30"},{"v":69.3,"d":"69.30"},{"v":69.3,"d":"69.30"},{"v":69.3,"d":"69.30"},{"v":69.3,"d":"69.30"}]
[{"$nulls":5},"Gasóleo",{"v":74.1,"d":"74.10"},{"v":74.1,"d":"74.10"},{"v":74.1,"d":"74.10"},{"v":74.1,"d":"74.10"},{"v":74.1,"d":"74.10"},{"v":74.1,"d":"74.10"},{"v":74.1,"d":"74.10"},{"v":74.1,"d":"74.10"},{"v":74.1,"d":"74.10"},{"v":74.1,"d":"74.10"}]
[{"$nulls":5},"Gas butano",{"v":66.2,"d":"66.20"},{"v":66.2,"d":"66.20"},{"v":66.2,"d":"66.20"},{"v":66.2,"d":"66.20"},{"v":66.2,"d":"66.20"},{"v":66.2,"d":"66.20"},{"v":66.2,"d":"66.20"},{"v":66.2,"d":"66.20"},{"v":66.2,"d":"66.20"},{"v":66.2,"d":"66.20"}]
[{"$nulls":5},"Gas propano",{"v":63.6,"d":"63.60"},{"v":63.6,"d":"63.60"},{"v":63.6,"d":"63.60"},{"v":63.6,"d":"63.60"},{"v":63.6,"d":"63.60"},{"v":63.6,"d":"63.60"},{"v":63.6,"d":"63.60"},{"v":63.6,"d":"63.60"},{"v":63.6,"d":"63.60"},{"v":63.6,"d":"63.60"}]
[{"$nulls":5},"Fuelóleo",{"v":77.4,"d":"77.40"},{"v":77.4,"d":"77.40"},{"v":77.4,"d":"77.40"},{"v":77.4,"d":"77.40"},{"v":77.4,"d":"77.40"},{"v":77.4,"d":"77.40"},{"v":77.4,"d":"77.40"},{"v":77.4,"d":"77.40"},{"v":77.4,"d":"77.40"},{"v":77.4,"d":"77.40"}]
[{"$nulls":5},"GLP genérico",{"v":63.1,"d":"63.10"},{"v":63.1,"d":"63.10"},{"v":63.1,"d":"63.10"},{"v":63.1,"d":"63.10"},{"v":63.1,"d":"63.10"},{"v":63.1,"d":"63.10"},{"v":63.1,"d":"63.10"},{"v":63.1,"d":"63.10"},{"v":63.1,"d":"63.10"},{"v":63.1,"d":"63.10"}]
[{"$nulls":5},"Carbón nacional",99.42,99.42,99.42,99.42,99.42,99.42,99.42,{"v":99.4,"d":"99.40"},{"v":99.4,"d":"99.40"},99.42]
[{"$nulls":5},"Carbón de importación",{"v":101,"d":"101.00"},{"v":101,"d":"101.00"},{"v":101,"d":"101.00"},{"v":101,"d":"101.00"},{"v":101,"d":"101.00"},{"v":101,"d":"101.00"},{"v":101,"d":"101.00"},{"v":101,"d":"101.00"},{"v":101,"d":"101.00"},{"v":101,"d":"101.00"}]
[{"$nulls":5},"Coque de petróleo",{"v":97.5,"d":"97.50"},{"v":97.5,"d":"97.50"},{"v":97.5,"d":"97.50"},{"v":97.5,"d":"97.50"},{"v":97.5,"d":"97.50"},{"v":97.5,"d":"97.50"},{"v":97.5,"d":"97.50"},{"v":97.5,"d":"97.50"},{"v":97.5,"d":"97.50"},{"v":97.5,"d":"97.50"}]
[]
[{"$nulls":4},"Fuente de los factores de emisión de los combustibles. Elaboración propia a partir de:"]
[{"$nulls":4},"Factores de emisión de CO2 y PCI que se incluyen en las distintas ediciones del Inventario Nacional de Emisiones de España (desde la edición 1990-2006 hasta la edición 1990-2018) y en las Directrices del IPCC para los inventarios nacionales de gases de efecto invernadero de 2006."]
[]
[{"$nulls":4},"Densidades especificadas en el Real Decreto 1088/2010, de 3 de septiembre por el que se modifica el RD 61/2006, de 31 de enero en lo relativo a las especificaciones técnicas de gasolinas, gasóleos, utilización de biocarburantes y contenido de azufre de los combustibles para uso marítimo. Se indican las densidades a 15ºC para los siguientes combustibles:"]
[{"$nulls":4},"           Gasóleo clase A (automoción): 820-845 kg/m3. Valor medio: 832,5 kg/m3"]
[{"$nulls":4},"           Gasóleo clase B (uso agrícola y marítimo): 820-880 kg/m3. Valor medio: 850 kg/m3"]
[{"$nulls":4},"           Gasóleo clase C (gasóleo de calefacción): 900 kg/m3"]
[{"$nulls":4},"           Gasolina: 720-775 kg/m3. Valor medio: 747,5 kg/m3"]
[{"$nulls":4},"Densidad del LPG: 560 kg/m3"]
[{"$nulls":4},"Descuentos por biocarburantes fijados por el RD 459/2011 relativo a los objetivos obligatorios mínimos de venta o consumo de biocarburantes establecidos para España, por la Ley 11/2013 de 26 de julio que modifica el objetivo a 2013 y posteriores del mismo y por el RD 1085/2015, de 4 de diciembre, de fomento de los biocarburantes.\nTenga en cuenta que a partir del nuevo etiquetado de los biocarburantes (RD 639/2016), el descuento de la parte bio de los mismos queda reflejado en la propia denominación."]
[{"$nulls":4},"2011: descuentos por biocarburantes fijados por el RD 459/2011 relativo a los objetivos obligatorios mínimos de venta o consumo de biocarburantes establecidos para España (fija una cantidad mínima de biocarburantes en diesel del 6% y de biocarburantes en gasolina del 3,9% para 2011)."]
[]
[{"$nulls":4},"2012: descuentos por biocarburantes fijados por el RD 459/2011 relativo a los objetivos obligatorios mínimos de venta o consumo de biocarburantes establecidos para España (fija una cantidad mínima de biocarburantes en diesel del 7% y de biocarburantes en gasolina del 4,1% para 2012)."]
[]
[{"$nulls":4},"2013-2015: descuentos por biocarburantes fijados por la Ley 11/2013 de 26 de julio de 2013 que modifica el RD 459/2011 relativo a los objetivos obligatorios mínimos de venta o consumo de biocarburantes establecidos para España (fija una cantidad mínima de biocarburantes en diesel del 4,1% y de biocarburantes en gasolina del 3,9%)."]
[]
[{"$nulls":4},"2016-2020: descuentos por biocarburantes fijados por el RD 1085/2015, de 4 de diciembre, de fomento de los biocarburantes (fija una cantidad mínima de biocarburantes en diésel y gasolina de 4,3%, 5%, 6%, 7% y 8,5% para los años 2016, 2017, 2018, 2019 y 2020 respectivamente)."]
[]
[{"$nulls":4},"Conversión unidades energéticas: 1GJ = 277,78 kWh. Manual de Estadísticas Energéticas. Agencia Internacional de la Energía."]
[]
[{"$nulls":3},"POTENCIALES DE CALENTAMIENTO ATMOSFÉRICO"]
[]
[{"$nulls":4},"Gases refrigerantes",{"$nulls":4},"Mezclas"]
[{"$nulls":4},"Nombre","Fórmula química","PCA(1)",null,null,"Nombre","Composición (%)",{"$nulls":3},"PCA(1)"]
[{"$nulls":4},"HFC-23","CH2F3",{"v":14800,"d":"14,800"},null,null,"R-404A","R-125/143a/134a (44/52/4)",{"$nulls":3},{"$f":"ROUND((0.44*G95+0.52*G99+0.04*G97),0)","v":{"v":3922,"d":"3,922"}}]
[{"$nulls":4},"HFC-32","CH2F2",675,null,null,"R-407A","R-32/125/134a (20/40/40)",{"$nulls":3},{"$f":"ROUND((0.2*G93+0.4*G97+0.4*G95),0)","v":{"v":2107,"d":"2,107"}}]
[{"$nulls":4},"HFC-41","CH3F",92,null,null,"R-407B","R-32/125/134a (10/70/20)  ",{"$nulls":3},{"$f":"ROUND((0.1*G93+0.7*G95+0.2*G97),0)","v":{"v":2804,"d":"2,804"}}]
[{"$nulls":4},"HFC-125","C2HF5",{"v":3500,"d":"3,500"},null,null,"R-407C","R-32/125/134a (23/25/52)",{"$nulls":3},{"$f":"ROUND((0.23*G93+0.25*G95+0.52*G97),0)","v":{"v":1774,"d":"1,774"}}]
[{"$nulls":4},"HFC-134","C2H2F4",{"v":1100,"d":"1,100"},null,null,"R-407F","R-32/125/134a (30/30/40)",{"$nulls":3},{"$f":"ROUND((0.3*G93+0.3*G95+0.4*G97),0)","v":{"v":1825,"d":"1,825"}}]
[{"$nulls":4},"HFC-134a","CH2FCF3",{"v":1430,"d":"1,430"},null,null,"R-410A","R-32/125 (50/50) ",{"$nulls":3},{"$f":"ROUND((0.5*G93+0.5*G95),0)","v":{"v":2088,"d":"2,088"}}]
[{"$nulls":4},"HFC-143","C2H3F3.",353,null,null,"R-410B","R-32/125 (45/55) ",{"$nulls":3},{"$f":"ROUND((0.45*G93+0.55*G95),0)","v":{"v":2229,"d":"2,229"}}]
[{"$nulls":4},"HFC-143a","C2H3F3",{"v":4470,"d":"4,470"},null,null,"R-413A","R-218/134a/600a (9/88/3)",{"$nulls":3},{"$f":"ROUND((0.09*8830+0.88*G97),0)","v":{"v":2053,"d":"2,053"}}]
[{"$nulls":4},"HFC-152","CH2FCH2F",53,null,null,"R-417A","R-125/134a/600 (46,6/50/3,4)",{"$nulls":3},{"$f":"ROUND((0.466*G95+0.5*G97),0)","v":{"v":2346,"d":"2,346"}}]
[{"$nulls":4},"HFC-152a","C2H4F2",124,null,null,"R-417B","R-125/134a/600 (79/18,25/2,75)",{"$nulls":3},{"$f":"ROUND((0.79*G95+0.1825*G97),0)","v":{"v":3026,"d":"3,026"}}]
[{"$nulls":4},"HFC-161","C2H2F",12,null,null,"R-422A","R-125/134a/600a (85,1/11,5/3,4)",{"$nulls":3},{"$f":"ROUND((0.851*G95+0.115*G97),0)","v":{"v":3143,"d":"3,143"}}]
[{"$nulls":4},"HFC-227ea","C3HF7",{"v":3220,"d":"3,220"},null,null,"R-422D","R-125/134a/600a (65,1/31,5/3,4)",{"$nulls":3},{"$f":"ROUND((0.651*G95+0.315*G97),0)","v":{"v":2729,"d":"2,729"}}]
[{"$nulls":4},"HFC-236cb","CH2FCF2CF3",{"v":1340,"d":"1,340"},null,null,"R-424A","R-125/134a/600a/600/601a (50,5/47/0,9/1/0)",{"$nulls":3},{"$f":"ROUND((0.505*G95+0.47*G97),0)","v":{"v":2440,"d":"2,440"}}]
[{"$nulls":4},"HFC-236ea","CHF2CHFCF3",{"v":1370,"d":"1,370"},null,null,"R-426A","R-134a/125/600/601a (93/5,1/1,3/0,6)",{"$nulls":3},{"$f":"ROUND((0.93*G97+0.051*G95),0)","v":{"v":1508,"d":"1,508"}}]
[{"$nulls":4},"HFC-236fa","C3H2F6",{"v":9810,"d":"9,810"},null,null,"R-427A","R-32/125/143a/134a (15/25/10/50)",{"$nulls":3},{"$f":"ROUND((0.15*G93+0.25*G95+0.1*G99+0.5*G97),0)","v":{"v":2138,"d":"2,138"}}]
[{"$nulls":4},"HFC-245ca","C3H3F5",693,null,null,"R-428A","R-125/143a/600a/290 (77,5/20/1,9/06)              ",{"$nulls":3},{"$f":"ROUND((0.775*G95+0.2*G99),0)","v":{"v":3607,"d":"3,607"}}]
[{"$nulls":4},"HFC-245fa","C3H3F5",{"v":1030,"d":"1,030"},null,null,"R-434A","R-125/143a/134a/600a (63,2/18/16/2,8)",{"$nulls":3},{"$f":"ROUND((0.632*G95+0.18*G99+0.16*G97),0)","v":{"v":3245,"d":"3,245"}}]
[{"$nulls":4},"HFC-365mfc","C4H5F5",794,null,null,"R-437A","R-125/134a/600/601 (19,5/78,5/1,4/06)",{"$nulls":3},{"$f":"ROUND((0.195*G95+0.785*G97),0)","v":{"v":1805,"d":"1,805"}}]
[{"$nulls":4},"HFC-43-10mee","C5H2F10",{"v":1640,"d":"1,640"},null,null,"R-438A","R-32/125/134a/600/601a (8,5/45/44,2/1,7/0,6)",{"$nulls":3},{"$f":"ROUND((0.085*G93+0.45*G95+0.442*G97),0)","v":{"v":2264,"d":"2,264"}}]
[{"$nulls":4},"Otros","-","-",null,null,"R-442A","R-32/125/134a/152a/227ea (31/31/30/3/5)",{"$nulls":3},{"$f":"ROUND((0.31*G93+0.31*G95+0.3*G97+0.03*G101+0.05*G103),0)","v":{"v":1888,"d":"1,888"}}]
[{"$nulls":9},"R-449A","R-32/R-125/HFO-1234yf/R-134a (24,3/24,7/25,3/25,7)",{"$nulls":3},{"v":1396,"d":"1,396"}]
[{"$nulls":9},"R-452A","R-125/R-32/HFO-1234yf (59/11/30)",{"$nulls":3},{"v":2140,"d":"2,140"}]
[{"$nulls":9},"R-453A","R-134a/125/32/227ea/600/601a (53,8/20/20/5/0,6/0,6)",{"$nulls":3},{"v":1765,"d":"1,765"}]
[{"$nulls":9},"R-507A","R-125/143a (50/50)",{"$nulls":3},{"v":3985,"d":"3,985"}]
[]
[{"$nulls":4},"(1) Potenciales de Calentamiento Atmosférico que se indican en el Cuarto Informe de Evaluación del IPCC (Reglamento 517/2014)."]
[]
[{"$nulls":3},"MIX ELÉCTRICO COMERCIALIZADORAS"]
[]
[{"$nulls":4},2009,{"$nulls":4},2010]
[{"$nulls":4},"Mix de comercializadoras sin GdO para 2009",{"$nulls":4},"Mix de comercializadoras sin GdO para 2010"]
[{"$nulls":4},0.33,"kg CO2/kWh",{"$nulls":3},0.31,"kg CO2/kWh"]
[]
[{"$nulls":4},"Comercializadora",null,null,"Factor Mix 2009\n(kg CO2/kWh)",null,"Comercializadora",{"$nulls":3},"Factor Mix 2010\n(kg CO2/kWh)"]
[{"$nulls":4},"ACCIONA GREEN ENERGY DEVELOPMENTS, S.L.",null,null,{"v":0,"d":"0.00"},null,"ACCIONA GREEN ENERGY DEVELOPMENTS, S.L.",{"$nulls":3},{"v":0,"d":"0.00"}]
[{"$nulls":4},"CENTRICA ENERGÍA, S.L.U.",null,null,{"v":0,"d":"0.00"},null,"DERIVADOS ENERGÉTICOS PARA EL TRANSPORTE Y LA INDUSTRIA, S.A. (DETISA)",{"$nulls":3},0.33]
[{"$nulls":4},"DERIVADOS ENERGÉTICOS PARA EL TRANSPORTE Y LA INDUSTRIA, S.A. (DETISA)",null,null,{"v":0.3400000035762787,"d":"0.34"},null,"E.ON ENERGÍA, S.L.",{"$nulls":3},0.13]
[{"$nulls":4},"E.ON ENERGÍA, S.L.",null,null,{"v":0.17000000178813934,"d":"0.17"},null,"ELEKTRIZITÄTS-GESELLSCHAFT LAUFENBURG ESPAÑA, S.L.",{"$nulls":3},{"v":0,"d":"0.00"}]
[{"$nulls":4},"ELEKTRIZITÄTS-GESELLSCHAFT LAUFENBURG ESPAÑA, S.L.",null,null,{"v":0.009999999776482582,"d":"0.01"},null,"ENDESA ENERGÍA, S.A.",{"$nulls":3},0.26]
[{"$nulls":4},"ENDESA ENERGÍA, S.A.",null,null,{"v":0.2800000011920929,"d":"0.28"},null,"ENÉRGYA VM GESTIÓN DE ENERGÍA, S.L.U.",{"$nulls":3},{"v":0,"d":"0.00"}]
[{"$nulls":4},"FACTOR ENERGÍA, S.A.",null,null,{"v":0.25999999046325684,"d":"0.26"},null,"FACTOR ENERGÍA, S.A",{"$nulls":3},0.21]
[{"$nulls":4},"GAS NATURAL COMERCIALIZADORA, S.A.",null,null,{"v":0.14000000059604645,"d":"0.14"},null,"GAS NATURAL COMERCIALIZADORA, S.A.",{"$nulls":3},0.06]
[{"$nulls":4},"GAS NATURAL SERVICIOS SDG, S.A.",null,null,{"v":0.14000000059604645,"d":"0.14"},null,"GAS NATURAL SERVICIOS SDG, S.A.",{"$nulls":3},0.05]
[{"$nulls":4},"GAS NATURAL SUR SDG, S.A",null,null,{"v":0.27000001072883606,"d":"0.27"},null,"GESTERNOVA, S.A.",{"$nulls":3},{"v":0,"d":"0.00"}]
[{"$nulls":4},"GESTERNOVA, S.A.",null,null,{"v":0,"d":"0.00"},null,"HIDROCANTABRICO ENERGÍA, S.A. UNIPERSONAL",{"$nulls":3},0.21]
[{"$nulls":4},"HIDROCANTABRICO ENERGÍA, S.A. UNIPERSONAL",null,null,{"v":0.23999999463558197,"d":"0.24"},null,"HIDROELÉCTRICA EL CARMEN ENERGÍA, S.L.",{"$nulls":3},0.28]
[{"$nulls":4},"IBERDROLA GENERACION, S.A.U.",null,null,{"v":0.12999999523162842,"d":"0.13"},null,"HISPAELEC ENERGÍA, S.A",{"$nulls":3},{"v":0,"d":"0.00"}]
[{"$nulls":4},"NATURGAS COMERCIALIZADORA, S.A.",null,null,{"v":0.28999999165534973,"d":"0.29"},null,"IBERDROLA GENERACION, S.A.U.",{"$nulls":3},{"v":0.1,"d":"0.10"}]
[{"$nulls":4},"NEXUS ENERGÍA, S.A.",null,null,{"v":0.27000001072883606,"d":"0.27"},null,"NATURGAS COMERCIALIZADORA, S.A.",{"$nulls":3},0.23]
[{"$nulls":4},"UNION FENOSA COMERCIAL, S.L.",null,null,{"v":0.30000001192092896,"d":"0.30"},null,"NEXUS ENERGÍA, S.A.",{"$nulls":3},0.28]
[{"$nulls":4},"http://gdo.cnmc.es/CNE/resumenGdo.do?anio=2009",{"$nulls":4},"NEXUS RENOVABLES, S.L.",{"$nulls":3},{"v":0,"d":"0.00"}]
[{"$nulls":9},"UNION FENOSA COMERCIAL, S.L.",{"$nulls":3},0.26]
[{"$nulls":9},"http://gdo.cnmc.es/CNE/resumenGdo.do?anio=2010"]
[]
[{"$nulls":4},2011,{"$nulls":4},2012]
[{"$nulls":4},"Mix de comercializadoras sin GdO para 2011",{"$nulls":4},"Mix de comercializadoras sin GdO para 2012"]
[{"$nulls":4},0.36,"kg CO2/kWh",{"$nulls":3},{"v":0.4,"d":"0.40"},"kg CO2/kWh"]
[]
[{"$nulls":4},"Comercializadora",null,null,"Factor Mix 2011\n(kg CO2/kWh)",null,"Comercializadora",{"$nulls":3},"Factor Mix 2012\n(kg CO2/kWh)"]
[{"$nulls":4},"ACCIONA GREEN ENERGY DEVELOPMENTS, S.L.",null,null,{"v":0,"d":"0.00"},null,"ACCIONA GREEN ENERGY DEVELOPMENTS, S.L.",{"$nulls":3},{"v":0,"d":"0.00"}]
[{"$nulls":4},"AE3000 AGENT COMERCIALITZADOR, S.L.",null,null,0.36,null,"ALPIQ ENERGÍA ESPAÑA, S.A.U.",{"$nulls":3},{"v":0.38999998569488525,"d":"0.39"}]
[{"$nulls":4},"ALPIQ ENERGÍA ESPAÑA, S.A.U.",null,null,0.35,null,"COMERCIALIZADORA LERSA , S.L.",{"$nulls":3},{"v":0.4000000059604645,"d":"0.40"}]
[{"$nulls":4},"COMERCIALIZADORA LERSA , S.L.",null,null,0.36,null,"DERIVADOS ENERGÉTICOS PARA EL TRANSPORTE Y LA INDUSTRIA, S.A. (DETISA)",{"$nulls":3},{"v":0.3100000023841858,"d":"0.31"}]
[{"$nulls":4},"DERIVADOS ENERGÉTICOS PARA EL TRANSPORTE Y LA INDUSTRIA, S.A. (DETISA)",null,null,0.16,null,"E.ON ENERGÍA, S.L.",{"$nulls":3},{"v":0.30000001192092896,"d":"0.30"}]
[{"$nulls":4},"E.ON ENERGÍA, S.L.",null,null,0.21,null,"EGL ENERGÍA IBERIA, S.L.",{"$nulls":3},{"v":0,"d":"0.00"}]
[{"$nulls":4},"EGL ENERGÍA IBERIA, S.L.",null,null,{"v":0,"d":"0.00"},null,"ENARA GESTIÓN Y MEDIACIÓN, S.L.",{"$nulls":3},{"v":0,"d":"0.00"}]
[{"$nulls":4},"ENARA GESTIÓN Y MEDIACIÓN, S.L.",null,null,0.19,null,"ENDESA ENERGÍA, S.A.",{"$nulls":3},{"v":0.3700000047683716,"d":"0.37"}]
[{"$nulls":4},"ENDESA ENERGÍA, S.A.",null,null,0.33,null,"ENÉRGYA VM GESTIÓN DE ENERGÍA, S.L.U.",{"$nulls":3},{"v":0,"d":"0.00"}]
[{"$nulls":4},"ENÉRGYA VM GESTIÓN DE ENERGÍA, S.L.U.",null,null,{"v":0,"d":"0.00"},null,"FACTOR ENERGÍA, S.A.",{"$nulls":3},0.25]
[{"$nulls":4},"FACTOR ENERGÍA, S.A",null,null,0.23,null,"GAS NATURAL COMERCIALIZADORA, S.A.",{"$nulls":3},{"v":0.14000000059604645,"d":"0.14"}]
[{"$nulls":4},"GAS NATURAL COMERCIALIZADORA, S.A.",null,null,0.08,null,"GAS NATURAL SERVICIOS SDG, S.A.",{"$nulls":3},{"v":0.12999999523162842,"d":"0.13"}]
[{"$nulls":4},"GAS NATURAL SERVICIOS SDG, S.A.",null,null,0.08,null,"GDF SUEZ ESPAÑA, S.A.U.",{"$nulls":3},{"v":0.009999999776482582,"d":"0.01"}]
[{"$nulls":4},"GDF SUEZ ESPAÑA, S.A.U.",null,null,{"v":0,"d":"0.00"},null,"GEOATLANTER, S.L.",{"$nulls":3},{"v":0,"d":"0.00"}]
[{"$nulls":4},"GESTERNOVA, S.A.",null,null,{"v":0,"d":"0.00"},null,"GESTERNOVA, S.A.",{"$nulls":3},{"v":0,"d":"0.00"}]
[{"$nulls":4},"HIDROCANTABRICO ENERGÍA, S.A. UNIPERSONAL",null,null,0.23,null,"HIDROCANTABRICO ENERGÍA, S.A. Unipersonal",{"$nulls":3},{"v":0.23999999463558197,"d":"0.24"}]
[{"$nulls":4},"HIDROELÉCTRICA EL CARMEN ENERGÍA, S.L.",null,null,0.33,null,"HIDROELÉCTRICA EL CARMEN ENERGÍA, S.L.",{"$nulls":3},{"v":0,"d":"0.00"}]
[{"$nulls":4},"IBERDROLA GENERACION, S.A.U.",null,null,0.17,null,"IBERDROLA GENERACION, S.A.U.",{"$nulls":3},{"v":0.23999999463558197,"d":"0.24"}]
[{"$nulls":4},"NATURGAS COMERCIALIZADORA, S.A.",null,null,0.26,null,"LA UNION ELECTRO INDUSTRIAL, S.L. \"UNIPERSONAL\"",{"$nulls":3},{"v":0.3499999940395355,"d":"0.35"}]
[{"$nulls":4},"NEXUS ENERGÍA, S.A.",null,null,0.36,null,"NATURGAS ENERGÍA COMERCIALIZADORA, S.A.U.",{"$nulls":3},0.25]
[{"$nulls":4},"NEXUS RENOVABLES, S.L.",null,null,{"v":0,"d":"0.00"},null,"NEXUS ENERGÍA, S.A.",{"$nulls":3},{"v":0.30000001192092896,"d":"0.30"}]
[{"$nulls":4},"SOM ENERGÍA, S.C.C.L.",null,null,{"v":0,"d":"0.00"},null,"NEXUS RENOVABLES, S.L.",{"$nulls":3},{"v":0.009999999776482582,"d":"0.01"}]
[{"$nulls":4},"UNION FENOSA COMERCIAL, S.L.",null,null,0.33,null,"SOM ENERGÍA, S.C.C.L.",{"$nulls":3},{"v":0,"d":"0.00"}]
[{"$nulls":4},"http://gdo.cnmc.es/CNE/resumenGdo.do?anio=2011",{"$nulls":4},"UNION FENOSA COMERCIAL, S.L.",{"$nulls":3},{"v":0.38999998569488525,"d":"0.39"}]
[{"$nulls":9},"ZENCER, S. COOP. AND",{"$nulls":3},{"v":0,"d":"0.00"}]
[{"$nulls":9},"http://gdo.cnmc.es/CNE/resumenGdo.do?anio=2012"]
[]
[{"$nulls":4},2013,{"$nulls":4},2014]
[{"$nulls":4},"Mix de comercializadoras sin GdO para 2013",{"$nulls":4},"Mix de comercializadoras sin GdO para 2014"]
[{"$nulls":4},0.36,"kg CO2/kWh",{"$nulls":3},0.37,"kg CO2/kWh"]
[]
[{"$nulls":4},"Comercializadora",null,null,"Factor Mix 2013\n(kg CO2/kWh)",null,"Comercializadora",{"$nulls":3},"Factor Mix 2014\n(kg CO2/kWh)"]
[{"$nulls":4},"ACCIONA GREEN ENERGY DEVELOPMENTS, S.L.",null,null,{"v":0,"d":"0.00"},null,"ACCIONA GREEN ENERGY DEVELOPMENTS, S.L.",{"$nulls":3},{"v":0,"d":"0.00"}]
[{"$nulls":4},"ALPIQ ENERGÍA ESPAÑA, S.A.U.",null,null,0.25,null,"AGENTE DEL MERCADO ELÉCTRICO, S.A.",{"$nulls":3},{"v":0.3700000047683716,"d":"0.37"}]
[{"$nulls":4},"AXPO IBERIA, S.L.",null,null,{"v":0.029999999329447746,"d":"0.03"},null,"AURA ENERGÍA, S.L.",{"$nulls":3},{"v":0.28999999165534973,"d":"0.29"}]
[{"$nulls":4},"CEPSA GAS Y ELECTRICIDAD",null,null,{"v":0,"d":"0.00"},null,"AVANZALIA ENERGÍA COMERCIALIZADORA, S.A.",{"$nulls":3},{"v":0,"d":"0.00"}]
[{"$nulls":4},"CLIDOM ENERGY, S.L.",null,null,{"v":0,"d":"0.00"},null,"AXPO IBERIA, S.L.",{"$nulls":3},{"v":0,"d":"0.00"}]
[{"$nulls":4},"COMERCIALIZADORA LERSA , S.L.",null,null,{"v":0.3499999940395355,"d":"0.35"},null,"CEPSA GAS Y ELECTRICIDAD, S.A.",{"$nulls":3},{"v":0,"d":"0.00"}]
[{"$nulls":4},"E.ON ENERGÍA, S.L.",null,null,0.25,null,"CIDE HCENERGÍA S.A.",{"$nulls":3},{"v":0.3700000047683716,"d":"0.37"}]
[{"$nulls":4},"ELECTRICA SOLLERENSE, S.A.",null,null,{"v":0,"d":"0.00"},null,"CLIDOM ENERGY, S.L.",{"$nulls":3},{"v":0,"d":"0.00"}]
[{"$nulls":4},"ENARA GESTIÓN Y MEDIACIÓN, S.L.",null,null,{"v":0,"d":"0.00"},null,"COMERCIALIZADORA LERSA , S.L.",{"$nulls":3},{"v":0.36000001430511475,"d":"0.36"}]
[{"$nulls":4},"ENDESA ENERGÍA, S.A.",null,null,{"v":0.3100000023841858,"d":"0.31"},null,"CYE ENERGÍA, S.L.",{"$nulls":3},{"v":0,"d":"0.00"}]
[{"$nulls":4},"ENDESA GENERACIÓN, S.A.",null,null,{"v":0.2800000011920929,"d":"0.28"},null,"E.ON ENERGÍA, S.L.",{"$nulls":3},{"v":0.27000001072883606,"d":"0.27"}]
[{"$nulls":4},"ENERCOLUZ ENERGÍA, S.L.",null,null,{"v":0.36000001430511475,"d":"0.36"},null,"ELECTRICA SOLLERENSE, S.A.",{"$nulls":3},{"v":0.25999999046325684,"d":"0.26"}]
[{"$nulls":4},"ENERGY BY COGEN, S.L.",null,null,{"v":0.3199999928474426,"d":"0.32"},null,"ENARA GESTIÓN Y MEDIACIÓN, S.L.",{"$nulls":3},{"v":0,"d":"0.00"}]
[{"$nulls":4},"ENÉRGYA VM GESTIÓN DE ENERGÍA, S.L.U.",null,null,{"v":0,"d":"0.00"},null,"ENDESA ENERGÍA, S.A.",{"$nulls":3},{"v":0.33000001311302185,"d":"0.33"}]
[{"$nulls":4},"FACTOR ENERGÍA, S.A.",null,null,{"v":0.23999999463558197,"d":"0.24"},null,"ENDESA GENERACIÓN, S.A.",{"$nulls":3},{"v":0,"d":"0.00"}]
[{"$nulls":4},"FENIE ENERGÍA, S.A.",null,null,{"v":0.3499999940395355,"d":"0.35"},null,"ENEL GREEN POWER ESPAÑA, S.L.",{"$nulls":3},{"v":0,"d":"0.00"}]
[{"$nulls":4},"GAS NATURAL COMERCIALIZADORA, S.A.",null,null,{"v":0.23000000417232513,"d":"0.23"},null,"ENERCOLUZ ENERGÍA, S.L.",{"$nulls":3},{"v":0.3100000023841858,"d":"0.31"}]
[{"$nulls":4},"GAS NATURAL SERVICIOS SDG, S.A.",null,null,{"v":0.23000000417232513,"d":"0.23"},null,"ENÉRGYA VM GESTIÓN DE ENERGÍA, S.L.U.",{"$nulls":3},{"v":0,"d":"0.00"}]
[{"$nulls":4},"GDF SUEZ ESPAÑA, S.A.U.",null,null,{"v":0.3199999928474426,"d":"0.32"},null,"FACTOR ENERGÍA, S.A.",{"$nulls":3},{"v":0.27000001072883606,"d":"0.27"}]
[{"$nulls":4},"GEOATLANTER, S.L.",null,null,{"v":0,"d":"0.00"},null,"FENIE ENERGÍA, S.A.",{"$nulls":3},{"v":0.3199999928474426,"d":"0.32"}]
[{"$nulls":4},"GESTERNOVA, S.A.",null,null,{"v":0,"d":"0.00"},null,"GAS NATURAL COMERCIALIZADORA, S.A.",{"$nulls":3},{"v":0.28999999165534973,"d":"0.29"}]
[{"$nulls":4},"GOIENER S.COOP",null,null,{"v":0,"d":"0.00"},null,"GAS NATURAL SERVICIOS SDG, S.A.",{"$nulls":3},{"v":0.28999999165534973,"d":"0.29"}]
[{"$nulls":4},"HIDROCANTABRICO ENERGÍA, S.A. Unipersonal",null,null,{"v":0.17000000178813934,"d":"0.17"},null,"GDF SUEZ ENERGÍA ESPAÑA, S.A.U.",{"$nulls":3},{"v":0.3400000035762787,"d":"0.34"}]
[{"$nulls":4},"HIDROELECTRICA DEL VALIRA, S.L.",null,null,{"v":0.14000000059604645,"d":"0.14"},null,"GEOATLANTER, S.L.",{"$nulls":3},{"v":0,"d":"0.00"}]
[{"$nulls":4},"HIDROELÉCTRICA EL CARMEN ENERGÍA, S.L.",null,null,{"v":0,"d":"0.00"},null,"GESTERNOVA, S.A.",{"$nulls":3},{"v":0,"d":"0.00"}]
[{"$nulls":4},"IBERDROLA GENERACION, S.A.U.",null,null,{"v":0.1599999964237213,"d":"0.16"},null,"GOIENER S.COOP",{"$nulls":3},{"v":0,"d":"0.00"}]
[{"$nulls":4},"LA UNION ELECTRO INDUSTRIAL, S.L. \"UNIPERSONAL\"",null,null,{"v":0,"d":"0.00"},null,"HIDROCANTABRICO ENERGÍA, S.A. Unipersonal",{"$nulls":3},{"v":0.1899999976158142,"d":"0.19"}]
[{"$nulls":4},"NATURGAS ENERGÍA COMERCIALIZADORA, S.A.U.",null,null,{"v":0.20999999344348907,"d":"0.21"},null,"HIDROELECTRICA DEL VALIRA, S.L.",{"$nulls":3},{"v":0.14000000059604645,"d":"0.14"}]
[{"$nulls":4},"NEXUS ENERGÍA, S.A.",null,null,{"v":0.11999999731779099,"d":"0.12"},null,"HIDROELÉCTRICA EL CARMEN ENERGÍA, S.L.",{"$nulls":3},{"v":0,"d":"0.00"}]
[{"$nulls":4},"NEXUS RENOVABLES, S.L.",null,null,{"v":0,"d":"0.00"},null,"IBERDROLA CLIENTES, S.A.U.",{"$nulls":3},{"v":0.119999997317791,"d":"0.12"}]
[{"$nulls":4},"OLTEN-LLUM, S.L.",null,null,{"v":0.3400000035762787,"d":"0.34"},null,"LA UNION ELECTRO INDUSTRIAL, S.L. \"UNIPERSONAL\"",{"$nulls":3},{"v":0.03999999910593033,"d":"0.04"}]
[{"$nulls":4},"SOM ENERGÍA, S.C.C.L.",null,null,{"v":0,"d":"0.00"},null,"NATURGAS ENERGÍA COMERCIALIZADORA, S.A.U.",{"$nulls":3},{"v":0.20000000298023224,"d":"0.20"}]
[{"$nulls":4},"UNIELÉCTRICA ENERGÍA, S.L.",null,null,{"v":0,"d":"0.00"},null,"NEXUS ENERGÍA, S.A.",{"$nulls":3},{"v":0.12999999523162842,"d":"0.13"}]
[{"$nulls":4},"UNION FENOSA COMERCIAL, S.L.",null,null,{"v":0.36000001430511475,"d":"0.36"},null,"NEXUS RENOVABLES, S.L.",{"$nulls":3},{"v":0,"d":"0.00"}]
[{"$nulls":4},"ZENCER, S. COOP. AND",null,null,{"v":0,"d":"0.00"},null,"OLTEN-LLUM, S.L.",{"$nulls":3},{"v":0.3400000035762787,"d":"0.34"}]
[{"$nulls":4},"http://gdo.cnmc.es/CNE/resumenGdo.do?anio=2013",{"$nulls":4},"ON DEMAND FACILITIES, S.L.",{"$nulls":3},{"v":0.3700000047683716,"d":"0.37"}]
[{"$nulls":9},"SOM ENERGÍA, S.C.C.L.",{"$nulls":3},{"v":0,"d":"0.00"}]
[{"$nulls":9},"THE YELLOW ENERGY, S.L.",{"$nulls":3},{"v":0,"d":"0.00"}]
[{"$nulls":9},"UNIELÉCTRICA ENERGÍA, S.A.",{"$nulls":3},{"v":0,"d":"0.00"}]
[{"$nulls":9},"VERTSEL ENERGÍA, S.L.U.",{"$nulls":3},{"v":0.019999999552965164,"d":"0.02"}]
[{"$nulls":9},"ZENCER, S. COOP. AND",{"$nulls":3},{"v":0.1599999964237213,"d":"0.16"}]
[{"$nulls":9},"http://gdo.cnmc.es/CNE/resumenGdo.do?anio=2014"]
[]
[{"$nulls":4},2015,{"$nulls":4},2016]
[{"$nulls":4},"Mix de comercializadoras sin GdO para 2015",{"$nulls":4},"Mix de comercializadoras sin GdO para 2016"]
[{"$nulls":4},{"v":0.4,"d":"0.40"},"kg CO2/kWh",{"$nulls":3},0.36,"kg CO2/kWh"]
[{"$nulls":9},0.36]
[{"$nulls":4},"Comercializadora",null,null,"Factor Mix 2015\n(kg CO2/kWh)",null,"Comercializadora",{"$nulls":3},"Factor Mix 2016\n(kg CO2/kWh)"]
[{"$nulls":4},"ACCIONA GREEN ENERGY DEVELOPMENTS, S.L.",null,null,{"v":0,"d":"0.00"},null,"ACCIONA GREEN ENERGY DEVELOPMENTS, S.L.",{"$nulls":3},{"v":0,"d":"0.00"}]
[{"$nulls":4},"ALDRO ENERGÍA Y SOLUCIONES, S.L.U.",null,null,{"v":0.4000000059604645,"d":"0.40"},null,"ACCIÓN ENERGÍA COMERCIALIZADORA, S.L.",{"$nulls":3},{"v":0,"d":"0.00"}]
[{"$nulls":4},"ANOTHER ENERGY OPTION, S.L.",null,null,{"v":0,"d":"0.00"},null,"ADEINNOVA ENERGÍA, S.L.U.",{"$nulls":3},{"v":0.33000001311302185,"d":"0.33"}]
[{"$nulls":4},"AUDAX ENERGÍA, S.L.U.",null,null,{"v":0.4000000059604645,"d":"0.40"},null,"AGRI-ENERGÍA, S.A.",{"$nulls":3},{"v":0,"d":"0.00"}]
[{"$nulls":4},"AURA ENERGÍA, S.L.",null,null,{"v":0,"d":"0.00"},null,"ALCANZIA ENERGÍA, S.L.",{"$nulls":3},{"v":0.30000001192092896,"d":"0.30"}]
[{"$nulls":4},"AVANZALIA ENERGÍA COMERCIALIZADORA, S.A.",null,null,0.25,null,"ALDRO ENERGÍA Y SOLUCIONES, S.L.U.",{"$nulls":3},{"v":0.36000001430511475,"d":"0.36"}]
[{"$nulls":4},"AXPO IBERIA, S.L.",null,null,{"v":0,"d":"0.00"},null,"ANOTHER ENERGY OPTION, S.L.",{"$nulls":3},{"v":0,"d":"0.00"}]
[{"$nulls":4},"BASSOLS ENERGÍA COMERCIAL, S.L.",null,null,{"v":0.38999998569488525,"d":"0.39"},null,"AQUÍ ENERGÍA, S.L.",{"$nulls":3},{"v":0,"d":"0.00"}]
[{"$nulls":4},"CEPSA GAS Y ELECTRICIDAD, S.A.",null,null,{"v":0,"d":"0.00"},null,"AUDAX ENERGÍA, S.L.U.",{"$nulls":3},{"v":0.36000001430511475,"d":"0.36"}]
[{"$nulls":4},"CLIDOM ENERGY, S.L.",null,null,{"v":0,"d":"0.00"},null,"AURA ENERGÍA, S.L.",{"$nulls":3},{"v":0,"d":"0.00"}]
[{"$nulls":4},"COMERCIALIZADORA LERSA , S.L.",null,null,{"v":0.4000000059604645,"d":"0.40"},null,"AVANZALIA ENERGÍA COMERCIALIZADORA, S.A.",{"$nulls":3},{"v":0.15000000596046448,"d":"0.15"}]
[{"$nulls":4},"COMERCIALIZADORA ZERO ELECTRUM, S.L.",null,null,{"v":0.4000000059604645,"d":"0.40"},null,"AXPO IBERIA, S.L.",{"$nulls":3},{"v":0,"d":"0.00"}]
[{"$nulls":4},"COMPAÑÍA ESCANDINAVA DE ELECTRICIDAD EN ESPAÑA, S.L.",null,null,{"v":0,"d":"0.00"},null,"BASSOLS ENERGÍA COMERCIAL, S.L.",{"$nulls":3},{"v":0,"d":"0.00"}]
[{"$nulls":4},"COOPERATIVA ELECTRICA DE CASTELLAR, S.C.V.",null,null,{"v":0,"d":"0.00"},null,"BETA RENOWABLE GROUP, S.A.",{"$nulls":3},{"v":0,"d":"0.00"}]
[{"$nulls":4},"CYE ENERGÍA, S.L.",null,null,{"v":0.029999999329447746,"d":"0.03"},null,"CEMOI ELECTRICITE, S.L. ",{"$nulls":3},{"v":0.18000000715255737,"d":"0.18"}]
[{"$nulls":4},"DREUE ELECTRIC, S.L.",null,null,{"v":0.019999999552965164,"d":"0.02"},null,"CEPSA GAS Y ELECTRICIDAD, S.A.",{"$nulls":3},{"v":0,"d":"0.00"}]
[{"$nulls":4},"E.ON ENERGÍA, S.L.",null,null,{"v":0.3400000035762787,"d":"0.34"},null,"CLIDOM ENERGY, S.L.",{"$nulls":3},{"v":0,"d":"0.00"}]
[{"$nulls":4},"ELECTRICA DE CHERA, S.C.V.",null,null,{"v":0,"d":"0.00"},null,"COMERCIALIZADORA ELÉCTRICA DE CADIZ, S.A.",{"$nulls":3},{"v":0,"d":"0.00"}]
[{"$nulls":4},"ELECTRICA DE GUADASSUAR COOP. V.",null,null,{"v":0,"d":"0.00"},null,"COMERCIALIZADORA LERSA , S.L.",{"$nulls":3},{"v":0.05000000074505806,"d":"0.05"}]
[{"$nulls":4},"ELECTRICA SOLLERENSE, S.A.",null,null,{"v":0.33000001311302185,"d":"0.33"},null,"COMPAÑÍA ESCANDINAVA DE ELECTRICIDAD EN ESPAÑA, S.L.",{"$nulls":3},{"v":0,"d":"0.00"}]
[{"$nulls":4},"ELÉCTRICA DE MELIANA, S.C.V.",null,null,{"v":0,"d":"0.00"},null,"COMPAÑÍA LUMISA ENERGÍAS, S.L.",{"$nulls":3},{"v":0.019999999552965164,"d":"0.02"}]
[{"$nulls":4},"ELÉCTRICA DE SOT DE CHERA S. COOP.V.",null,null,{"v":0,"d":"0.00"},null,"COOPERATIVA ELÉCTRICA DE CASTELLAR, S.C.V.",{"$nulls":3},{"v":0,"d":"0.00"}]
[{"$nulls":4},"ELÉCTRICA DE VINALESA, S.L.U.",null,null,{"v":0.20999999344348907,"d":"0.21"},null,"COOPERATIVA ELÉCTRICA BENÉFICA CATRALENSE, COOP. V.",{"$nulls":3},{"v":0,"d":"0.00"}]
[{"$nulls":4},"EMASP, S. COOP.",null,null,{"v":0,"d":"0.00"},null,"COOPERATIVA ELÉCTRICA BENÉFICA SAN FRANCISCO DE ASÍS, COOP. V.",{"$nulls":3},{"v":0,"d":"0.00"}]
[{"$nulls":4},"ENARA GESTIÓN Y MEDIACIÓN, S.L.",null,null,{"v":0,"d":"0.00"},null,"COOPERATIVA ELÉCTRICA-BENÉFICA ALBATERENSE, COOP.V.",{"$nulls":3},{"v":0,"d":"0.00"}]
[{"$nulls":4},"ENDESA ENERGÍA, S.A.",null,null,{"v":0.3799999952316284,"d":"0.38"},null,"CYE ENERGÍA, S.L.",{"$nulls":3},{"v":0,"d":"0.00"}]
[{"$nulls":4},"ENERCOLUZ ENERGÍA, S.L.",null,null,{"v":0.33000001311302185,"d":"0.33"},null,"DAIMUZ ENERGÍA, S.L.",{"$nulls":3},{"v":0.36000001430511475,"d":"0.36"}]
[{"$nulls":4},"ENERGY STROM XXI, S.L.",null,null,{"v":0.4000000059604645,"d":"0.40"},null,"DREUE ELECTRIC, S.L.",{"$nulls":3},{"v":0,"d":"0.00"}]
[{"$nulls":4},"ENERGÍA COLECTIVA, S.L.",null,null,{"v":0,"d":"0.00"},null,"DRK ENERGY, S.L.",{"$nulls":3},{"v":0,"d":"0.00"}]
[{"$nulls":4},"ENERPLUS ENERGÍA, S.A.",null,null,{"v":0.009999999776482582,"d":"0.01"},null,"EDP COMERCIALIZADORA, S.A.U.",{"$nulls":3},{"v":0.23999999463558197,"d":"0.24"}]
[{"$nulls":4},"ENÉRGYA VM GESTIÓN DE ENERGÍA, S.L.U.",null,null,{"v":0,"d":"0.00"},null,"EDP Energía S.A.U.",{"$nulls":3},{"v":0.23999999463558197,"d":"0.24"}]
[{"$nulls":4},"FACTOR ENERGÍA, S.A.",null,null,{"v":0.3100000023841858,"d":"0.31"},null,"ELECNOVA SIGLO XXI, S.L.",{"$nulls":3},{"v":0,"d":"0.00"}]
[{"$nulls":4},"FENIE ENERGÍA, S.A.",null,null,{"v":0.36000001430511475,"d":"0.36"},null,"ELECTRA DEL CARDENER ENERGÍA, S.A.",{"$nulls":3},{"v":0,"d":"0.00"}]
[{"$nulls":4},"GAS NATURAL COMERCIALIZADORA, S.A.",null,null,{"v":0.3499999940395355,"d":"0.35"},null,"ELÉCTRICA ALBATERENSE, S.L.",{"$nulls":3},{"v":0,"d":"0.00"}]
[{"$nulls":4},"GAS NATURAL SERVICIOS SDG, S.A.",null,null,{"v":0.36000001430511475,"d":"0.36"},null,"ELÉCTRICA ALGIMIA DE ALFARA, S.COOP.V.",{"$nulls":3},{"v":0,"d":"0.00"}]
[{"$nulls":4},"GDF SUEZ ENERGÍA ESPAÑA, S.A.U.",null,null,{"v":0.3499999940395355,"d":"0.35"},null,"ELÉCTRICA CATRALENSE, S.L.",{"$nulls":3},{"v":0.029999999329447746,"d":"0.03"}]
[{"$nulls":4},"GEOATLANTER, S.L.",null,null,{"v":0.14000000059604645,"d":"0.14"},null,"ELÉCTRICA DE CHERA, S.C.V.",{"$nulls":3},{"v":0,"d":"0.00"}]
[{"$nulls":4},"GESTERNOVA, S.A.",null,null,{"v":0,"d":"0.00"},null,"ELÉCTRICA DE GUADASSUAR COOP. V.",{"$nulls":3},{"v":0,"d":"0.00"}]
[{"$nulls":4},"GNERA ENERGÍA Y TECNOLOGIA, S.L.",null,null,{"v":0,"d":"0.00"},null,"ELÉCTRICA DIRECTA ENERGÍA, S.L.",{"$nulls":3},{"v":0,"d":"0.00"}]
[{"$nulls":4},"GOIENER S.COOP",null,null,{"v":0.009999999776482582,"d":"0.01"},null,"ELÉCTRICA SOLLERENSE, S.A.",{"$nulls":3},{"v":0,"d":"0.00"}]
[{"$nulls":4},"HIDROCANTABRICO ENERGÍA, S.A. Unipersonal",null,null,{"v":0.23000000417232513,"d":"0.23"},null,"ELECTRODISTRIBUIDORA DE FUERZA Y ALUMBRADO CASABLANCA, S. COOP.V.",{"$nulls":3},{"v":0,"d":"0.00"}]
[{"$nulls":4},"HIDROELECTRICA DEL VALIRA, S.L.",null,null,{"v":0.30000001192092896,"d":"0.30"},null,"ELYGAS POWER, S.L.",{"$nulls":3},{"v":0,"d":"0.00"}]
[{"$nulls":4},"HIDROELÉCTRICA EL CARMEN ENERGÍA, S.L.",null,null,{"v":0,"d":"0.00"},null,"ELÉCTRICA DE MELIANA, S.C.V.",{"$nulls":3},{"v":0,"d":"0.00"}]
[{"$nulls":4},"IBERDROLA CLIENTES, S.A.U.",null,null,{"v":0.20999999344348907,"d":"0.21"},null,"ELÉCTRICA DE SOT DE CHERA S. COOP.V.",{"$nulls":3},{"v":0,"d":"0.00"}]
[{"$nulls":4},"INDEXO ENERGÍA, S.L.",null,null,{"v":0.10000000149011612,"d":"0.10"},null,"ELÉCTRICA DE VINALESA, S.L.U.",{"$nulls":3},{"v":0.03999999910593033,"d":"0.04"}]
[{"$nulls":4},"INICIATIVA E. NOVA, S.L.",null,null,{"v":0,"d":"0.00"},null,"ELÉCTRICA DEL POZO, S.COOP.MAD.",{"$nulls":3},{"v":0,"d":"0.00"}]
[{"$nulls":4},"LA UNION ELECTRO INDUSTRIAL, S.L. \"UNIPERSONAL\"",null,null,{"v":0,"d":"0.00"},null,"ELÉCTRICA NTRA. SRA. DE GRACIA SDAD. COOP. VALENCIANA",{"$nulls":3},{"v":0,"d":"0.00"}]
[{"$nulls":4},"LIGHT UP, S.L.",null,null,{"v":0,"d":"0.00"},null,"EMASP, S. COOP.",{"$nulls":3},{"v":0,"d":"0.00"}]
[{"$nulls":4},"LUCI MUNDI ENERGÍA, S.L.",null,null,{"v":0.17000000178813934,"d":"0.17"},null,"ENARA GESTIÓN Y MEDIACIÓN, S.L.",{"$nulls":3},{"v":0,"d":"0.00"}]
[{"$nulls":4},"NATURGAS ENERGÍA COMERCIALIZADORA, S.A.U.",null,null,{"v":0.23000000417232513,"d":"0.23"},null,"ENDESA ENERGÍA, S.A.",{"$nulls":3},{"v":0.3400000035762787,"d":"0.34"}]
[{"$nulls":4},"NEXUS ENERGÍA, S.A.",null,null,{"v":0.11999999731779099,"d":"0.12"},null,"ENERCOLUZ ENERGÍA, S.L.",{"$nulls":3},{"v":0.30000001192092896,"d":"0.30"}]
[{"$nulls":4},"NEXUS RENOVABLES, S.L.",null,null,{"v":0.019999999552965164,"d":"0.02"},null,"ENERGEA SAVING ENERGY, S.L.",{"$nulls":3},{"v":0,"d":"0.00"}]
[{"$nulls":4},"ON DEMAND FACILITIES, S.L.",null,null,{"v":0.03999999910593033,"d":"0.04"},null,"ENERGÍA NARANJA, S.L.",{"$nulls":3},{"v":0,"d":"0.00"}]
[{"$nulls":4},"PROT ENERGÍA COMERCIALIZACIÓN, S.L.",null,null,{"v":0,"d":"0.00"},null,"ENERGY STROM XXI, S.L.",{"$nulls":3},{"v":0.3199999928474426,"d":"0.32"}]
[{"$nulls":4},"RENEWABLE VENTURES, S.L.",null,null,{"v":0,"d":"0.00"},null,"ENERGY TRADER SOLUTIONS, S.L.",{"$nulls":3},{"v":0.3400000035762787,"d":"0.34"}]
[{"$nulls":4},"SAMPOL INGENIERÍA Y OBRAS, S.A.",null,null,{"v":0.3100000023841858,"d":"0.31"},null,"ENERGÍA COLECTIVA, S.L.",{"$nulls":3},{"v":0,"d":"0.00"}]
[{"$nulls":4},"SOM ENERGÍA, S.C.C.L.",null,null,{"v":0,"d":"0.00"},null,"ENERGÍA DLR COMERCIALIZADORA, S.L.",{"$nulls":3},{"v":0.36000001430511475,"d":"0.36"}]
[{"$nulls":4},"SUMINISTROS ESPECIALES ALGINETENSES COOP. V.",null,null,{"v":0,"d":"0.00"},null,"ENERPLUS ENERGÍA, S.A.",{"$nulls":3},{"v":0,"d":"0.00"}]
[{"$nulls":4},"SYDER COMERCIALIZADORA VERDE, S.L.",null,null,{"v":0,"d":"0.00"},null,"ENGIE ESPAÑA, S.L.U.",{"$nulls":3},{"v":0.3400000035762787,"d":"0.34"}]
[{"$nulls":4},"TELEFÓNICA SOLUCIONES DE INFORMÁTICA Y COMUNICACIONES DE ESPAÑA, S.A.U.",null,null,{"v":0.05000000074505806,"d":"0.05"},null,"ENÉRGYA VM GESTIÓN DE ENERGÍA, S.L.U.",{"$nulls":3},{"v":0,"d":"0.00"}]
[{"$nulls":4},"THE YELLOW ENERGY, S.L.",null,null,{"v":0,"d":"0.00"},null,"EPRESA ENERGÍA, S.A.U.",{"$nulls":3},{"v":0,"d":"0.00"}]
[{"$nulls":4},"UNIELÉCTRICA ENERGÍA, S.A.",null,null,{"v":0,"d":"0.00"},null,"ESTABANELL Y PAHISA MERCATOR, S.A.",{"$nulls":3},{"v":0,"d":"0.00"}]
[{"$nulls":4},"VERTSEL ENERGÍA, S.L.U.",null,null,{"v":0,"d":"0.00"},null,"ESTRATEGIAS ELÉCTRICAS INTEGRALES, S.A.",{"$nulls":3},{"v":0.2800000011920929,"d":"0.28"}]
[{"$nulls":4},"WATIUM, S.L.",null,null,{"v":0,"d":"0.00"},null,"EXPORT INNOVATION GROUP S.L.",{"$nulls":3},{"v":0,"d":"0.00"}]
[{"$nulls":4},"ZENCER, S. COOP. AND",null,null,{"v":0,"d":"0.00"},null,"FACTOR ENERGÍA, S.A.",{"$nulls":3},{"v":0.28999999165534973,"d":"0.29"}]
[{"$nulls":4},"http://gdo.cnmc.es/CNE/resumenGdo.do?anio=2015",{"$nulls":4},"FENIE ENERGÍA, S.A.",{"$nulls":3},{"v":0,"d":"0.00"}]
[{"$nulls":9},"FLUIDO ELÉCTRICO MUSEROS, SCV",{"$nulls":3},{"v":0,"d":"0.00"}]
[{"$nulls":9},"FOENER COMERCIALIZACIÓN, S.L.U.",{"$nulls":3},{"v":0.36000001430511475,"d":"0.36"}]
[{"$nulls":9},"FUSIONA COMERCIALIZADORA, S.A.",{"$nulls":3},{"v":0,"d":"0.00"}]
[{"$nulls":9},"GAOLANIA SERVICIOS, S.L.",{"$nulls":3},{"v":0.3400000035762787,"d":"0.34"}]
[{"$nulls":9},"GAS NATURAL COMERCIALIZADORA, S.A.",{"$nulls":3},{"v":0.28999999165534973,"d":"0.29"}]
[{"$nulls":9},"GAS NATURAL SERVICIOS SDG, S.A.",{"$nulls":3},{"v":0.28999999165534973,"d":"0.29"}]
[{"$nulls":9},"GEO ALTERNATIVA, S.L.",{"$nulls":3},{"v":0,"d":"0.00"}]
[{"$nulls":9},"GEOATLANTER, S.L.",{"$nulls":3},{"v":0,"d":"0.00"}]
[{"$nulls":9},"GESTERNOVA, S.A.",{"$nulls":3},{"v":0,"d":"0.00"}]
[{"$nulls":9},"GIGABUSINESS, S.L.",{"$nulls":3},{"v":0.07000000029802322,"d":"0.07"}]
[{"$nulls":9},"GLOBAL BIOSFERA PROTEC, S.L.",{"$nulls":3},{"v":0.3199999928474426,"d":"0.32"}]
[{"$nulls":9},"GENERA ENERGÍA Y TECNOLOGIA, S.L.",{"$nulls":3},{"v":0,"d":"0.00"}]
[{"$nulls":9},"GOIENER S.COOP",{"$nulls":3},{"v":0,"d":"0.00"}]
[{"$nulls":9},"HIDROELÉCTRICA DEL VALIRA, S.L.",{"$nulls":3},{"v":0,"d":"0.00"}]
[{"$nulls":9},"HIDROELÉCTRICA EL CARMEN ENERGÍA, S.L.",{"$nulls":3},{"v":0,"d":"0.00"}]
[{"$nulls":9},"IBERDROLA CLIENTES, S.A.U.",{"$nulls":3},{"v":0.15000000596046448,"d":"0.15"}]
[{"$nulls":9},"INDEXO ENERGÍA, S.L.",{"$nulls":3},{"v":0.10999999940395355,"d":"0.11"}]
[{"$nulls":9},"INICIATIVA E. NOVA, S.L.",{"$nulls":3},{"v":0,"d":"0.00"}]
[{"$nulls":9},"INTEGRACIÓN EUROPEA DE ENERGÍA, S.A.U.",{"$nulls":3},{"v":0.36000001430511475,"d":"0.36"}]
[{"$nulls":9},"LA UNION ELECTRO INDUSTRIAL, S.L. \"UNIPERSONAL\"",{"$nulls":3},{"v":0,"d":"0.00"}]
[{"$nulls":9},"LONJAS TECNOLOGIA, S.A.",{"$nulls":3},{"v":0.28999999165534973,"d":"0.29"}]
[{"$nulls":9},"LUVON ENERGÍA, S.L.",{"$nulls":3},{"v":0,"d":"0.00"}]
[{"$nulls":9},"NEXUS ENERGÍA, S.A.",{"$nulls":3},{"v":0.019999999552965164,"d":"0.02"}]
[{"$nulls":9},"NEXUS RENOVABLES, S.L.",{"$nulls":3},{"v":0,"d":"0.00"}]
[{"$nulls":9},"NINOBE SERVICIOS ENERGÉTICOS, S.L.",{"$nulls":3},{"v":0.27000001072883606,"d":"0.27"}]
[{"$nulls":9},"NOBE SOLUCIONES Y ENERGÍA",{"$nulls":3},{"v":0,"d":"0.00"}]
[{"$nulls":9},"NOSA ENERXIA SOCIEDADE COOP GALEGA",{"$nulls":3},{"v":0,"d":"0.00"}]
[{"$nulls":9},"ODF ENERGÍA LIBRE COMERCIALIZADORA, S.L.",{"$nulls":3},{"v":0,"d":"0.00"}]
[{"$nulls":9},"ON DEMAND FACILITIES, S.L.U.",{"$nulls":3},{"v":0,"d":"0.00"}]
[{"$nulls":9},"PEPEENERGY",{"$nulls":3},{"v":0,"d":"0.00"}]
[{"$nulls":9},"PETRONIEVES ENERGÍA 1, S.L.",{"$nulls":3},{"v":0.25999999046325684,"d":"0.26"}]
[{"$nulls":9},"PHOTON GESTION",{"$nulls":3},{"v":0,"d":"0.00"}]
[{"$nulls":9},"PROT ENERGÍA COMERCIALIZACIÓN, S.L.",{"$nulls":3},{"v":0,"d":"0.00"}]
[{"$nulls":9},"PULSAR SERVICIOS ENERGÉTICOS,",{"$nulls":3},{"v":0,"d":"0.00"}]
[{"$nulls":9},"RENEWABLE VENTURES, S.L.",{"$nulls":3},{"v":0,"d":"0.00"}]
[{"$nulls":9},"REYSE ENERGÍA, S.L.",{"$nulls":3},{"v":0.07000000029802322,"d":"0.07"}]
[{"$nulls":9},"RONDA OESTE ENERGÍA, S.L.",{"$nulls":3},{"v":0,"d":"0.00"}]
[{"$nulls":9},"SAMPOL INGENIERÍA Y OBRAS, S.A.",{"$nulls":3},{"v":0.30000001192092896,"d":"0.30"}]
[{"$nulls":9},"SOM ENERGÍA, S.C.C.L.",{"$nulls":3},{"v":0,"d":"0.00"}]
[{"$nulls":9},"SUMINISTROS ESPECIALES ALGINETENSES COOP. V.",{"$nulls":3},{"v":0,"d":"0.00"}]
[{"$nulls":9},"SUNAIR ONE ENERGY, S.L.",{"$nulls":3},{"v":0.3100000023841858,"d":"0.31"}]
[{"$nulls":9},"SYDER COMERCIALIZADORA VERDE, S.L.",{"$nulls":3},{"v":0,"d":"0.00"}]
[{"$nulls":9},"TELEFÓNICA SOLUCIONES DE INFORMÁTICA Y COMUNICACIONES DE ESPAÑA, S.A.U.",{"$nulls":3},{"v":0,"d":"0.00"}]
[{"$nulls":9},"THE YELLOW ENERGY, S.L.",{"$nulls":3},{"v":0,"d":"0.00"}]
[{"$nulls":9},"TRADE UNIVERSAL ENERGY, S.A.",{"$nulls":3},{"v":0,"d":"0.00"}]
[{"$nulls":9},"UNIC GLOBAL-LOGISTICS S.L.",{"$nulls":3},{"v":0,"d":"0.00"}]
[{"$nulls":9},"UNIELÉCTRICA ENERGÍA, S.A.",{"$nulls":3},{"v":0,"d":"0.00"}]
[{"$nulls":9},"V3J INGENIERIA Y SERVICIOS, S.L.",{"$nulls":3},{"v":0.2800000011920929,"d":"0.28"}]
[{"$nulls":9},"VIESGO ENERGíA, S.L.",{"$nulls":3},{"v":0.25999999046325684,"d":"0.26"}]
[{"$nulls":9},"WATIUM, S.L.",{"$nulls":3},{"v":0,"d":"0.00"}]
[{"$nulls":9},"WIND TO MARKET, S.A.",{"$nulls":3},{"v":0,"d":"0.00"}]
[{"$nulls":9},"ZENCER, S. COOP. AND",{"$nulls":3},{"v":0,"d":"0.00"}]
[{"$nulls":9},"https://gdo.cnmc.es/CNE/resumenGdo.do?anio=2016"]
[{"$nulls":4},2017,{"$nulls":4},2018]
[{"$nulls":4},"Mix de comercializadoras sin GdO para 2017",{"$nulls":4},"Mix de comercializadoras sin GdO para 2018"]
[{"$nulls":4},0.43,"kg CO2/kWh",{"$nulls":3},0.41,"kg CO2/kWh"]
[]
[{"$nulls":4},"Comercializadora",null,null,"Factor Mix 2017\n(kg CO2/kWh)",null,"Comercializadora",{"$nulls":3},"Factor Mix 2018\n(kg CO2/kWh)"]
[{"$nulls":4},"A-DOS ENERGíA, S.L. ",null,null,{"v":0.3400000035762787,"d":"0.34"},null,"24-7 UTILITIES, S.L.U.",{"$nulls":3},{"v":0,"d":"0.00"}]
[{"$nulls":4},"ACCIONA GREEN ENERGY DEVELOPMENTS, S.L.",null,null,{"v":0,"d":"0.00"},null,"ACCIONA GREEN ENERGY DEVELOPMENTS, S.L.",{"$nulls":3},{"v":0,"d":"0.00"}]
[{"$nulls":4},"ACCIÓN ENERGÍA COMERCIALIZADORA, S.L.",null,null,{"v":0.07000000029802322,"d":"0.07"},null,"ACCIÓN ENERGÍA COMERCIALIZADORA, S.L.",{"$nulls":3},{"v":0,"d":"0.00"}]
[{"$nulls":4},"ACSOL ENERGÍA GLOBAL, S.A.",null,null,{"v":0.4300000071525574,"d":"0.43"},null,"ACSOL ENERGÍA GLOBAL, S.A.",{"$nulls":3},{"v":0.4099999964237213,"d":"0.41"}]
[{"$nulls":4},"ADEINNOVA ENERGÍA, S.L.U.",null,null,{"v":0.38999998569488525,"d":"0.39"},null,"ADEINNOVA ENERGÍA, S.L.U.",{"$nulls":3},{"v":0.3100000023841858,"d":"0.31"}]
[{"$nulls":4},"AGENTE DEL MERCADO ELÉCTRICO, S.A.",null,null,{"v":0.41999998688697815,"d":"0.42"},null,"ADELFAS ENERGÍA, S.L.",{"$nulls":3},{"v":0.3499999940395355,"d":"0.35"}]
[{"$nulls":4},"AGRI-ENERGÍA, S.A.",null,null,{"v":0,"d":"0.00"},null,"AGENTE DEL MERCADO ELÉCTRICO, S.A.",{"$nulls":3},{"v":0.36000001430511475,"d":"0.36"}]
[{"$nulls":4},"ALCANZIA ENERGÍA, S.L.",null,null,{"v":0.3199999928474426,"d":"0.32"},null,"AGRI-ENERGÍA, S.A.",{"$nulls":3},{"v":0,"d":"0.00"}]
[{"$nulls":4},"ALDRO ENERGÍA Y SOLUCIONES, S.L.U.",null,null,{"v":0.41999998688697815,"d":"0.42"},null,"AGUAS DE BARBASTRO ENERGÍA, S.L.",{"$nulls":3},{"v":0.4099999964237213,"d":"0.41"}]
[{"$nulls":4},"ALPIQ ENERGÍA ESPAÑA, S.A.U.",null,null,{"v":0.05999999865889549,"d":"0.06"},null,"ALCANZIA ENERGÍA, S.L.",{"$nulls":3},{"v":0.30000001192092896,"d":"0.30"}]
[{"$nulls":4},"ANOTHER ENERGY OPTION, S.L.",null,null,{"v":0.019999999552965164,"d":"0.02"},null,"ALDRO ENERGÍA Y SOLUCIONES, S.L.U.",{"$nulls":3},{"v":0.4000000059604645,"d":"0.40"}]
[{"$nulls":4},"APELES ELECTRICIDAD, S.L.",null,null,{"v":0,"d":"0.00"},null,"ALILUZ MEDITERRANEA, S.L.",{"$nulls":3},{"v":0,"d":"0.00"}]
[{"$nulls":4},"AQUÍ ENERGÍA, S.L.",null,null,{"v":0,"d":"0.00"},null,"ALPIQ ENERGÍA ESPAÑA, S.A.U.",{"$nulls":3},{"v":0.11999999731779099,"d":"0.12"}]
[{"$nulls":4},"ASAL DE ENERGÍA, S.L. ",null,null,{"v":0,"d":"0.00"},null,"ANOTHER ENERGY OPTION, S.L.",{"$nulls":3},{"v":0.3499999940395355,"d":"0.35"}]
[{"$nulls":4},"AUDAX ENERGÍA, S.L.U.",null,null,{"v":0.4099999964237213,"d":"0.41"},null,"AQUÍ ENERGÍA, S.L.",{"$nulls":3},{"v":0,"d":"0.00"}]
[{"$nulls":4},"AURA ENERGÍA, S.L.",null,null,{"v":0,"d":"0.00"},null,"ASAL DE ENERGÍA, S.L. ",{"$nulls":3},{"v":0,"d":"0.00"}]
[{"$nulls":4},"AUSARTA PRIMA, S.L.",null,null,{"v":0,"d":"0.00"},null,"AUDAX ENERGÍA, S.L.U.",{"$nulls":3},{"v":0.28999999165534973,"d":"0.29"}]
[{"$nulls":4},"AVANZALIA ENERGÍA COMERCIALIZADORA, S.A.",null,null,{"v":0.10999999940395355,"d":"0.11"},null,"AURA ENERGÍA, S.L.",{"$nulls":3},{"v":0,"d":"0.00"}]
[{"$nulls":4},"AXPO IBERIA, S.L.",null,null,{"v":0,"d":"0.00"},null,"AUSARTA PRIMA, S.L.",{"$nulls":3},{"v":0,"d":"0.00"}]
[{"$nulls":4},"BASSOLS ENERGÍA COMERCIAL, S.L.",null,null,{"v":0,"d":"0.00"},null,"AVANZALIA ENERGÍA COMERCIALIZADORA, S.A.",{"$nulls":3},0.25]
[{"$nulls":4},"CEPSA GAS Y ELECTRICIDAD, S.A.",null,null,{"v":0,"d":"0.00"},null,"AXPO IBERIA, S.L.",{"$nulls":3},{"v":0,"d":"0.00"}]
[{"$nulls":4},"CLIDOM ENERGY, S.L.",null,null,{"v":0,"d":"0.00"},null,"BASSOLS ENERGÍA COMERCIAL, S.L.",{"$nulls":3},{"v":0,"d":"0.00"}]
[{"$nulls":4},"COMERCIALIZADORA ELÉCTRICA DE CÁDIZ, S.A.",null,null,{"v":0,"d":"0.00"},null,"CATGAS ENERGÍA, S.A.",{"$nulls":3},{"v":0.4000000059604645,"d":"0.40"}]
[{"$nulls":4},"COMERCIALIZADORA ELÉCTRICA TALAYUELAS, S.L.",null,null,{"v":0,"d":"0.00"},null,"CEMOI ELECTRICITE, S.L. ",{"$nulls":3},{"v":0.3799999952316284,"d":"0.38"}]
[{"$nulls":4},"COMERCIALIZADORA LERSA , S.L.",null,null,{"v":0,"d":"0.00"},null,"CEPSA COMERCIAL PETRÓLEO,\r\nS.A.U.",{"$nulls":3},{"v":0,"d":"0.00"}]
[{"$nulls":4},"COMPAÑÍA ESCANDINAVA DE ELECTRICIDAD EN ESPAÑA, S.L.",null,null,{"v":0,"d":"0.00"},null,"CEPSA GAS Y ELECTRICIDAD, S.A.",{"$nulls":3},{"v":0,"d":"0.00"}]
[{"$nulls":4},"COOPERATIVA ELÉCTRICA DE CASTELLAR, S.C.V.",null,null,{"v":0,"d":"0.00"},null,"CHITAHI ENERGY, S.L.",{"$nulls":3},{"v":0,"d":"0.00"}]
[{"$nulls":4},"COOPERATIVA ELÉCTRICA BENÉFICA CATRALENSE, COOP. V.",null,null,{"v":0,"d":"0.00"},null,"CLIDOM ENERGY, S.L.",{"$nulls":3},{"v":0,"d":"0.00"}]
[{"$nulls":4},"COOPERATIVA ELÉCTRICA BENÉFICA SAN FRANCISCO DE ASÍS, COOP. V.",null,null,{"v":0,"d":"0.00"},null,"COMERCIALIZADORA DE ELECTRICIDAD Y GAS DEL MEDITERRÁNEO, S.L.",{"$nulls":3},{"v":0,"d":"0.00"}]
[{"$nulls":4},"COOPERATIVA ELÉCTRICA-BENÉFICA ALBATERENSE, COOP.V.",null,null,{"v":0,"d":"0.00"},null,"COMERCIALIZADORA DE ENERGÍA DIRECTA, S.L.",{"$nulls":3},{"v":0,"d":"0.00"}]
[{"$nulls":4},"COOPERATIVA VALENCIANA ELECTRODISTRIBUIDORA DE FUERZA Y ALUMBRADO SERRALLO, S.Coop.V.",null,null,{"v":0,"d":"0.00"},null,"COMERCIALIZADORA ELECTRICA DE CADIZ, S.A.",{"$nulls":3},{"v":0,"d":"0.00"}]
[{"$nulls":4},"COX ENERGÍA COMERCIALIZADORA ESPAÑA, S.L.U.",null,null,{"v":0,"d":"0.00"},null,"COMERCIALIZADORA ELÉCTRICA TALAYUELAS, S.L.",{"$nulls":3},{"v":0,"d":"0.00"}]
[{"$nulls":4},"CYE ENERGÍA, S.L.",null,null,{"v":0,"d":"0.00"},null,"COMERCIALIZADORA LERSA , S.L.",{"$nulls":3},{"v":0,"d":"0.00"}]
[{"$nulls":4},"DAIMUZ ENERGÍA, S.L.",null,null,{"v":0,"d":"0.00"},null,"COMPAÑÍA ESCANDINAVA DE ELECTRICIDAD EN ESPAÑA, S.L.",{"$nulls":3},{"v":0,"d":"0.00"}]
[{"$nulls":4},"DISA ENERGÍA ELÉCTRICA, S.L.U.",null,null,{"v":0,"d":"0.00"},null,"COOPERATIVA ELECTRICA DE CASTELLAR, S.C.V.",{"$nulls":3},{"v":0,"d":"0.00"}]
[{"$nulls":4},"DREUE ELECTRIC, S.L.",null,null,{"v":0.25999999046325684,"d":"0.26"},null,"COOPERATIVA ELÉCTRICA BENÉFICA CATRALENSE, COOP. V.",{"$nulls":3},{"v":0,"d":"0.00"}]
[{"$nulls":4},"DRK ENERGY, S.L.",null,null,{"v":0.019999999552965164,"d":"0.02"},null,"COOPERATIVA ELÉCTRICA BENÉFICA SAN FRANCISCO DE ASÍS, COOP. V.",{"$nulls":3},{"v":0,"d":"0.00"}]
[{"$nulls":4},"ECOFUTURA LUZ ENERGÍA, S.L.",null,null,{"v":0,"d":"0.00"},null,"COOPERATIVA ELÉCTRICA-BENÉFICA ALBATERENSE, COOP.V.",{"$nulls":3},{"v":0,"d":"0.00"}]
[{"$nulls":4},"EDP COMERCIALIZADORA, S.A.U.",null,null,{"v":0.25999999046325684,"d":"0.26"},null,"COOPERATIVA VALENCIANA ELECTRODISTRIBUIDORA DE FUERZA Y ALUMBRADO SERRALLO, S.Coop.V.",{"$nulls":3},{"v":0,"d":"0.00"}]
[{"$nulls":4},"EDP ENERGÍA S.A.U.",null,null,0.25,null,"COX ENERGÍA COMERCIALIZADORA ESPAÑA, S.L.U.",{"$nulls":3},{"v":0,"d":"0.00"}]
[{"$nulls":4},"ELECNOVA SIGLO XXI, S.L.",null,null,{"v":0,"d":"0.00"},null,"CYE ENERGÍA, S.L.",{"$nulls":3},{"v":0.009999999776482582,"d":"0.01"}]
[{"$nulls":4},"ELECTRA CALDENSE ENERGÍA, S.A.",null,null,{"v":0,"d":"0.00"},null,"DAIMUZ ENERGÍA, S.L.",{"$nulls":3},{"v":0,"d":"0.00"}]
[{"$nulls":4},"ELECTRA DEL CARDENER ENERGÍA, S.A.",null,null,{"v":0,"d":"0.00"},null,"DISA ENERGÍA ELECTRICA, S.L.U.",{"$nulls":3},{"v":0,"d":"0.00"}]
[{"$nulls":4},"ELÉCTRICA ALBATERENSE, S.L.",null,null,{"v":0,"d":"0.00"},null,"DREUE ELECTRIC, S.L.",{"$nulls":3},{"v":0.4000000059604645,"d":"0.40"}]
[{"$nulls":4},"ELÉCTRICA CATRALENSE, S.L.",null,null,{"v":0,"d":"0.00"},null,"DRK ENERGY, S.L.",{"$nulls":3},{"v":0,"d":"0.00"}]
[{"$nulls":4},"ELÉCTRICA DE CHERA, S.C.V.",null,null,{"v":0,"d":"0.00"},null,"ECOEQ ENERGÉTICA, S.L.",{"$nulls":3},{"v":0.4000000059604645,"d":"0.40"}]
[{"$nulls":4},"ELÉCTRICA DE GUADASSUAR COOP. V.",null,null,{"v":0,"d":"0.00"},null,"ECOFUTURA LUZ ENERGÍA, S.L.",{"$nulls":3},{"v":0.15000000596046448,"d":"0.15"}]
[{"$nulls":4},"ELÉCTRICA DE GUIXES ENERG¿A, S.L.",null,null,{"v":0.30000001192092896,"d":"0.30"},null,"ECONACTIVA, S. COOP DE C-LM",{"$nulls":3},{"v":0,"d":"0.00"}]
[{"$nulls":4},"ELÉCTRICA DIRECTA ENERGÍA, S.L.",null,null,{"v":0.05999999865889549,"d":"0.06"},null,"EDP COMERCIALIZADORA, S.A.U.",{"$nulls":3},{"v":0.23000000417232513,"d":"0.23"}]
[{"$nulls":4},"ELÉCTRICA SOLLERENSE, S.A.",null,null,{"v":0,"d":"0.00"},null,"EDP ENERGÍA S.A.U.",{"$nulls":3},{"v":0.23000000417232513,"d":"0.23"}]
[{"$nulls":4},"ELÉCTRICA DE MELIANA, S.C.V.",null,null,{"v":0,"d":"0.00"},null,"ELECNOVA SIGLO XXI, S.L.",{"$nulls":3},{"v":0.3499999940395355,"d":"0.35"}]
[{"$nulls":4},"ELÉCTRICA DE SOT DE CHERA S. COOP.V.",null,null,{"v":0,"d":"0.00"},null,"ELECTRA ALTO MIÑO COMERCIALIZADORA DE ENERGÍA, S.L.U.",{"$nulls":3},{"v":0.4099999964237213,"d":"0.41"}]
[{"$nulls":4},"ELÉCTRICA DE VINALESA, S.L.U.",null,null,{"v":0.05999999865889549,"d":"0.06"},null,"ELECTRA CALDENSE ENERGÍA, S.A.",{"$nulls":3},{"v":0,"d":"0.00"}]
[{"$nulls":4},"EMASP, S. COOP.",null,null,{"v":0,"d":"0.00"},null,"ELECTRA CUNTIENSE COMERCIALIZADORA, S.L.U.",{"$nulls":3},{"v":0.4099999964237213,"d":"0.41"}]
[{"$nulls":4},"EMPRESA DE ALUMBRADO ELÉCTRICO DE CEUTA, S.A.",null,null,{"v":0.41999998688697815,"d":"0.42"},null,"ELECTRA DEL CARDENER ENERGÍA, S.A.",{"$nulls":3},{"v":0,"d":"0.00"}]
[{"$nulls":4},"ENARA GESTIÓN Y MEDIACIÓN, S.L.",null,null,{"v":0,"d":"0.00"},null,"ELECTRA ENERGÍA, S.A.U.",{"$nulls":3},{"v":0.3700000047683716,"d":"0.37"}]
[{"$nulls":4},"ENDESA ENERGÍA, S.A.",null,null,{"v":0.38999998569488525,"d":"0.39"},null,"ELECTRA NORTE ENERGÍA, S.A.U.",{"$nulls":3},{"v":0.4099999964237213,"d":"0.41"}]
[{"$nulls":4},"ENERCOLUZ ENERGÍA, S.L.",null,null,{"v":0,"d":"0.00"},null,"ELECTRICA ALBATERENSE, S.L.",{"$nulls":3},{"v":0,"d":"0.00"}]
[{"$nulls":4},"ENERGEA SAVING ENERGY, S.L.",null,null,{"v":0,"d":"0.00"},null,"ELECTRICA CATRALENSE, S.L.",{"$nulls":3},{"v":0,"d":"0.00"}]
[{"$nulls":4},"ENERGY STROM XXI, S.L.",null,null,{"v":0.3700000047683716,"d":"0.37"},null,"ELECTRICA DE CHERA, S.C.V.",{"$nulls":3},{"v":0,"d":"0.00"}]
[{"$nulls":4},"ENERGÍA COLECTIVA, S.L.",null,null,{"v":0,"d":"0.00"},null,"ELECTRICA DE GUADASSUAR COOP. V.",{"$nulls":3},{"v":0,"d":"0.00"}]
[{"$nulls":4},"ENERGÍA DLR COMERCIALIZADORA, S.L.",null,null,{"v":0.4300000071525574,"d":"0.43"},null,"ELECTRICA DE GUIXES ENERGÍA, S.L.",{"$nulls":3},{"v":0.3499999940395355,"d":"0.35"}]
[{"$nulls":4},"ENERPLUS ENERGÍA, S.A.",null,null,{"v":0.33000001311302185,"d":"0.33"},null,"ELECTRICA DIRECTA ENERGÍA, S.L.",{"$nulls":3},{"v":0,"d":"0.00"}]
[{"$nulls":4},"ENGIE ESPAÑA, S.L.U.",null,null,{"v":0.3799999952316284,"d":"0.38"},null,"ELECTRICA SEROSENSE, S.L.",{"$nulls":3},{"v":0.38999998569488525,"d":"0.39"}]
[{"$nulls":4},"ENÉRGYA VM GESTIÓN DE ENERGÍA, S.L.U.",null,null,{"v":0,"d":"0.00"},null,"ELECTRICA SOLLERENSE, S.A.",{"$nulls":3},{"v":0,"d":"0.00"}]
[{"$nulls":4},"ESTABANELL Y PAHISA MERCATOR, S.A.",null,null,{"v":0,"d":"0.00"},null,"ELECTRICA VAQUER ENERGÍA, S.A.",{"$nulls":3},{"v":0,"d":"0.00"}]
[{"$nulls":4},"ESTRATEGIAS ELÉCTRICAS INTEGRALES, S.A.",null,null,{"v":0.3199999928474426,"d":"0.32"},null,"ELÉCTRICA DE MELIANA, S.C.V.",{"$nulls":3},{"v":0,"d":"0.00"}]
[{"$nulls":4},"FACTOR ENERGÍA, S.A.",null,null,{"v":0.3199999928474426,"d":"0.32"},null,"ELÉCTRICA DE SOT DE CHERA S. COOP.V.",{"$nulls":3},{"v":0,"d":"0.00"}]
[{"$nulls":4},"FENIE ENERGÍA, S.A.",null,null,{"v":0,"d":"0.00"},null,"ELÉCTRICA DE VINALESA, S.L.U.",{"$nulls":3},{"v":0,"d":"0.00"}]
[{"$nulls":4},"FOENER COMERCIALIZACIÓN, S.L.U.",null,null,{"v":0.36000001430511475,"d":"0.36"},null,"ELÉCTRICA NTRA. SRA. DE GRACIA SDAD. COOP. VALENCIANA",{"$nulls":3},{"v":0.3700000047683716,"d":"0.37"}]
[{"$nulls":4},"GALP ENERGÍA ESPAÑA S.A.U.",null,null,{"v":0.4099999964237213,"d":"0.41"},null,"EMASP, S. COOP.",{"$nulls":3},{"v":0,"d":"0.00"}]
[{"$nulls":4},"GAOLANIA SERVICIOS, S.L.",null,null,{"v":0,"d":"0.00"},null,"EMPRESA DE ALUMBRADO ELECTRICO DE CEUTA, S.A.",{"$nulls":3},{"v":0.4099999964237213,"d":"0.41"}]
[{"$nulls":4},"GAS NATURAL COMERCIALIZADORA, S.A.",null,null,{"v":0.3499999940395355,"d":"0.35"},null,"ENARA GESTIÓN Y MEDIACIÓN, S.L.",{"$nulls":3},{"v":0,"d":"0.00"}]
[{"$nulls":4},"GAS NATURAL FENOSA RENOVABLES, S.L.U.",null,null,{"v":0,"d":"0.00"},null,"ENDESA ENERGÍA, S.A.",{"$nulls":3},{"v":0.3799999952316284,"d":"0.38"}]
[{"$nulls":4},"GAS NATURAL SERVICIOS SDG, S.A.",null,null,{"v":0.38999998569488525,"d":"0.39"},null,"ENDESA GENERACIÓN, S.A.",{"$nulls":3},{"v":0,"d":"0.00"}]
[{"$nulls":4},"GEO ALTERNATIVA, S.L.",null,null,{"v":0,"d":"0.00"},null,"ENERCOLUZ ENERGÍA, S.L.",{"$nulls":3},{"v":0.1599999964237213,"d":"0.16"}]
[{"$nulls":4},"GEOATLANTER, S.L.",null,null,{"v":0,"d":"0.00"},null,"ENERGEA SAVING ENERGY, S.L.",{"$nulls":3},{"v":0,"d":"0.00"}]
[{"$nulls":4},"GESTERNOVA, S.A.",null,null,{"v":0,"d":"0.00"},null,"ENERGÍA NARANJA, S.L.",{"$nulls":3},0.25]
[{"$nulls":4},"GIGABUSINESS, S.L.",null,null,{"v":0,"d":"0.00"},null,"ENERGY STROM XXI, S.L.",{"$nulls":3},{"v":0.20000000298023224,"d":"0.20"}]
[{"$nulls":4},"GNERA ENERGÍA Y TECNOLOGÍA, S.L.",null,null,{"v":0,"d":"0.00"},null,"ENERGY TRADER SOLUTIONS, S.L.",{"$nulls":3},{"v":0.4099999964237213,"d":"0.41"}]
[{"$nulls":4},"GOIENER S.COOP",null,null,{"v":0,"d":"0.00"},null,"ENERGÍA NUFRI, S.L.U.",{"$nulls":3},{"v":0,"d":"0.00"}]
[{"$nulls":4},"HIDROELÉCTRICA DEL VALIRA, S.L.",null,null,{"v":0,"d":"0.00"},null,"ENERGÍA COLECTIVA, S.L.",{"$nulls":3},{"v":0,"d":"0.00"}]
[{"$nulls":4},"HIDROELÉCTRICA EL CARMEN ENERGÍA, S.L.",null,null,{"v":0,"d":"0.00"},null,"ENERGÍA DLR COMERCIALIZADORA, S.L.",{"$nulls":3},{"v":0.4099999964237213,"d":"0.41"}]
[{"$nulls":4},"IBERDROLA CLIENTES, S.A.U.",null,null,{"v":0.2800000011920929,"d":"0.28"},null,"ENERGÍA ELÉCTRICA EFICIENTE, S.L",{"$nulls":3},{"v":0,"d":"0.00"}]
[{"$nulls":4},"IM3 ENERGÍA, S.L.",null,null,{"v":0,"d":"0.00"},null,"ENERKIA ENERGÍA, S.L",{"$nulls":3},{"v":0,"d":"0.00"}]
[{"$nulls":4},"INDEXO ENERGÍA, S.L.",null,null,{"v":0.23000000417232513,"d":"0.23"},null,"ENERPLUS ENERGÍA, S.A.",{"$nulls":3},{"v":0.2800000011920929,"d":"0.28"}]
[{"$nulls":4},"INICIATIVA E. NOVA, S.L.",null,null,{"v":0.009999999776482582,"d":"0.01"},null,"ENERPLUS, S.COOP.",{"$nulls":3},{"v":0,"d":"0.00"}]
[{"$nulls":4},"INTEGRACIÓN EUROPEA DE ENERGÍA SUR, S.L.",null,null,{"v":0.4300000071525574,"d":"0.43"},null,"ENGIE ESPAÑA, S.L.U.",{"$nulls":3},{"v":0.3499999940395355,"d":"0.35"}]
[{"$nulls":4},"INTEGRACIÓN EUROPEA DE ENERGÍA, S.A.U.",null,null,{"v":0.4300000071525574,"d":"0.43"},null,"ENSTROGA, S.L.",{"$nulls":3},{"v":0.4000000059604645,"d":"0.40"}]
[{"$nulls":4},"KILOWATIOS VERDES, S.L.",null,null,{"v":0.11999999731779099,"d":"0.12"},null,"ENÉRGYA VM GESTIÓN DE ENERGÍA, S.L.U.",{"$nulls":3},{"v":0.14000000059604645,"d":"0.14"}]
[{"$nulls":4},"LA UNIÓN ELECTRO INDUSTRIAL, S.L.U.",null,null,{"v":0,"d":"0.00"},null,"EPRESA ENERGÍA, S.A.U.",{"$nulls":3},{"v":0,"d":"0.00"}]
[{"$nulls":4},"LONJAS TECNOLOGIA, S.A.",null,null,{"v":0.3100000023841858,"d":"0.31"},null,"ESTABANELL Y PAHISA MERCATOR, S.A.",{"$nulls":3},{"v":0,"d":"0.00"}]
[{"$nulls":4},"LUBALOO, S.L.",null,null,{"v":0,"d":"0.00"},null,"ESTRATEGIAS ELÉCTRICAS INTEGRALES, S.A.",{"$nulls":3},{"v":0.07999999821186066,"d":"0.08"}]
[{"$nulls":4},"NABALIA ENERGÍA 2000, S.A.",null,null,{"v":0.3400000035762787,"d":"0.34"},null,"EVERGREEN ELÉCTRICA, S.L.",{"$nulls":3},{"v":0.4000000059604645,"d":"0.40"}]
[{"$nulls":4},"NEXUS ENERGÍA, S.A.",null,null,{"v":0,"d":"0.00"},null,"FACTOR ENERGÍA, S.A.",{"$nulls":3},{"v":0.2800000011920929,"d":"0.28"}]
[{"$nulls":4},"NINOBE SERVICIOS ENERGÉTICOS, S.L.",null,null,{"v":0.4000000059604645,"d":"0.40"},null,"FENIE ENERGÍA, S.A.",{"$nulls":3},{"v":0,"d":"0.00"}]
[{"$nulls":4},"NOBE SOLUCIONES Y ENERGÍA",null,null,{"v":0,"d":"0.00"},null,"FOENER COMERCIALIZACIÓN, S.L.U.",{"$nulls":3},{"v":0.36000001430511475,"d":"0.36"}]
[{"$nulls":4},"NOSA ENERXIA SOCIEDADE COOP GALEGA",null,null,{"v":0,"d":"0.00"},null,"FORZA VSUNAIR, S.L.",{"$nulls":3},{"v":0.09000000357627869,"d":"0.09"}]
[{"$nulls":4},"NUEVA COMERCIALIZADORA ESPAÑOLA, S.L.",null,null,{"v":0.4000000059604645,"d":"0.40"},null,"FUSIONA COMERCIALIZADORA, S.A.",{"$nulls":3},{"v":0,"d":"0.00"}]
[{"$nulls":4},"ODF ENERGÍA LIBRE COMERCIALIZADORA, S.L.",null,null,{"v":0,"d":"0.00"},null,"GALP ENERGÍA ESPAÑA S.A.U.",{"$nulls":3},{"v":0.3499999940395355,"d":"0.35"}]
[{"$nulls":4},"ON DEMAND FACILITIES, S.L.U.",null,null,{"v":0.05999999865889549,"d":"0.06"},null,"GAOLANIA SERVICIOS, S.L.",{"$nulls":3},{"v":0,"d":"0.00"}]
[{"$nulls":4},"PEPEENERGY",null,null,{"v":0,"d":"0.00"},null,"GAS NATURAL COMERCIALIZADORA, S.A.",{"$nulls":3},0.25]
[{"$nulls":4},"PETRO NAVARRA, S.L.",null,null,{"v":0,"d":"0.00"},null,"GAS NATURAL FENOSA RENOVABLES, S.L.U.",{"$nulls":3},{"v":0,"d":"0.00"}]
[{"$nulls":4},"PETRONIEVES ENERGÍA 1, S.L.",null,null,{"v":0.38999998569488525,"d":"0.39"},null,"GAS NATURAL SERVICIOS SDG, S.A.",{"$nulls":3},{"v":0.4099999964237213,"d":"0.41"}]
[{"$nulls":4},"PHOTON GESTIÓN",null,null,{"v":0,"d":"0.00"},null,"GEO ALTERNATIVA, S.L.",{"$nulls":3},{"v":0,"d":"0.00"}]
[{"$nulls":4},"PROT ENERGÍA COMERCIALIZACIÓN, S.L.",null,null,{"v":0,"d":"0.00"},null,"GEOATLANTER, S.L.",{"$nulls":3},{"v":0,"d":"0.00"}]
[{"$nulls":4},"PULSAR SERVICIOS ENERGÉTICOS, S.L.",null,null,{"v":0,"d":"0.00"},null,"GERENTA ENERGÍA, S.L.U",{"$nulls":3},{"v":0,"d":"0.00"}]
[{"$nulls":4},"RENEWABLE VENTURES, S.L.",null,null,{"v":0,"d":"0.00"},null,"GESTERNOVA, S.A.",{"$nulls":3},{"v":0,"d":"0.00"}]
[{"$nulls":4},"SAMPOL INGENIERÍA Y OBRAS, S.A.",null,null,{"v":0.3199999928474426,"d":"0.32"},null,"GLOBAL BIOSFERA PROTEC, S.L.",{"$nulls":3},{"v":0,"d":"0.00"}]
[{"$nulls":4},"SOM ENERGÍA, S.C.C.L.",null,null,{"v":0,"d":"0.00"},null,"GNERA ENERGÍA Y TECNOLOGIA, S.L.",{"$nulls":3},{"v":0,"d":"0.00"}]
[{"$nulls":4},"SUMINISTRADORA ELÉCTRICA VIENTOS ALISIOS DE LANZAROTE, S.L.",null,null,{"v":0,"d":"0.00"},null,"GOIENER S.COOP",{"$nulls":3},{"v":0,"d":"0.00"}]
[{"$nulls":4},"SUMINISTROS ESPECIALES ALGINETENSES COOP. V.",null,null,{"v":0,"d":"0.00"},null,"GRUPO IBERSOGAS ENERGÍA, S.L.",{"$nulls":3},{"v":0.4099999964237213,"d":"0.41"}]
[{"$nulls":4},"SWAP ENERGÍA, S.A.",null,null,{"v":0.38999998569488525,"d":"0.39"},null,"HELIA COOP V",{"$nulls":3},{"v":0,"d":"0.00"}]
[{"$nulls":4},"SYDER COMERCIALIZADORA VERDE, S.L.",null,null,{"v":0,"d":"0.00"},null,"HELIOELEC ENERGÍA ELECTRICA, S.L.",{"$nulls":3},{"v":0,"d":"0.00"}]
[{"$nulls":4},"TELEFÓNICA SOLUCIONES DE INFORMÁTICA Y COMUNICACIONES DE ESPAÑA, S.A.U.",null,null,{"v":0,"d":"0.00"},null,"HIDROELECTRICA DEL VALIRA, S.L.",{"$nulls":3},{"v":0,"d":"0.00"}]
[{"$nulls":4},"THE YELLOW ENERGY, S.L.",null,null,{"v":0,"d":"0.00"},null,"HIDROELÉCTRICA EL CARMEN ENERGÍA, S.L.",{"$nulls":3},{"v":0,"d":"0.00"}]
[{"$nulls":4},"TRADE UNIVERSAL ENERGY, S.A.",null,null,{"v":0,"d":"0.00"},null,"IBERDROLA CLIENTES, S.A.U.",{"$nulls":3},{"v":0.27000001072883606,"d":"0.27"}]
[{"$nulls":4},"UNIELÉCTRICA ENERGÍA, S.A.",null,null,{"v":0,"d":"0.00"},null,"IBERDROLA GENERACION ESPAÑA, S.A.U.",{"$nulls":3},{"v":0,"d":"0.00"}]
[{"$nulls":4},"V3J INGENIERIA Y SERVICIOS, S.L.",null,null,{"v":0.3700000047683716,"d":"0.37"},null,"IBERDROLA SERVICIOS ENERGETICOS, S.A.U.",{"$nulls":3},{"v":0,"d":"0.00"}]
[{"$nulls":4},"VIESGO ENERGÍA, S.L.",null,null,{"v":0.3199999928474426,"d":"0.32"},null,"IBERELECTRICA COMERCIALIZADORA, S.L.",{"$nulls":3},{"v":0.4099999964237213,"d":"0.41"}]
[{"$nulls":4},"WATIUM, S.L.",null,null,{"v":0,"d":"0.00"},null,"IM3 ENERGÍA, S.L.",{"$nulls":3},{"v":0.3100000023841858,"d":"0.31"}]
[{"$nulls":4},"WIND TO MARKET, S.A.",null,null,{"v":0.18000000715255737,"d":"0.18"},null,"INDEXO ENERGÍA, S.L.",{"$nulls":3},{"v":0.3100000023841858,"d":"0.31"}]
[{"$nulls":4},"https://gdo.cnmc.es/CNE/resumenGdo.do?anio=2017",{"$nulls":4},"INER ENERGÍA CASTILLA LA MANCHA, S.L.",{"$nulls":3},{"v":0.4099999964237213,"d":"0.41"}]
[{"$nulls":9},"INICIATIVA E. NOVA, S.L.",{"$nulls":3},{"v":0,"d":"0.00"}]
[{"$nulls":9},"INTEGRACION EUROPEA DE ENERGÍA SUR, S.L.",{"$nulls":3},{"v":0.4099999964237213,"d":"0.41"}]
[{"$nulls":9},"INTEGRACIÓN EUROPEA DE ENERGÍA, S.A.U.",{"$nulls":3},{"v":0.4099999964237213,"d":"0.41"}]
[{"$nulls":9},"KILOWATIOS VERDES, S.L.",{"$nulls":3},{"v":0.009999999776482582,"d":"0.01"}]
[{"$nulls":9},"LA UNION ELECTRO INDUSTRIAL, S.L.U.",{"$nulls":3},{"v":0,"d":"0.00"}]
[{"$nulls":9},"LEDESMA COMERCIALIZADORA ELÉCTRICA, S.L.",{"$nulls":3},{"v":0,"d":"0.00"}]
[{"$nulls":9},"LONJAS TECNOLOGIA, S.A.",{"$nulls":3},{"v":0.3400000035762787,"d":"0.34"}]
[{"$nulls":9},"LUBALOO, S.L.",{"$nulls":3},{"v":0,"d":"0.00"}]
[{"$nulls":9},"MEGARA ENERGÍA SOCIEDAD COOPERATIVA CYL",{"$nulls":3},{"v":0,"d":"0.00"}]
[{"$nulls":9},"MULTIENERGÍA VERDE, S.L.",{"$nulls":3},{"v":0.029999999329447746,"d":"0.03"}]
[{"$nulls":9},"NABALIA ENERGÍA 2000, S.A.",{"$nulls":3},{"v":0.3100000023841858,"d":"0.31"}]
[{"$nulls":9},"NEXUS ENERGÍA, S.A.",{"$nulls":3},{"v":0,"d":"0.00"}]
[{"$nulls":9},"NINOBE SERVICIOS ENERGÉTICOS, S.L.",{"$nulls":3},{"v":0.3700000047683716,"d":"0.37"}]
[{"$nulls":9},"NOBE SOLUCIONES Y ENERGÍA",{"$nulls":3},{"v":0,"d":"0.00"}]
[{"$nulls":9},"NOSA ENERXIA SOCIEDADE COOP GALEGA",{"$nulls":3},{"v":0,"d":"0.00"}]
[{"$nulls":9},"ODF ENERGÍA LIBRE COMERCIALIZADORA, S.L.",{"$nulls":3},{"v":0,"d":"0.00"}]
[{"$nulls":9},"ON DEMAND FACILITIES, S.L.U.",{"$nulls":3},{"v":0,"d":"0.00"}]
[{"$nulls":9},"PEPEENERGY",{"$nulls":3},{"v":0,"d":"0.00"}]
[{"$nulls":9},"PETRO NAVARRA, S.L.",{"$nulls":3},{"v":0,"d":"0.00"}]
[{"$nulls":9},"PETRONIEVES ENERGÍA 1, S.L.",{"$nulls":3},{"v":0.38999998569488525,"d":"0.39"}]
[{"$nulls":9},"PHOTON GESTION",{"$nulls":3},{"v":0,"d":"0.00"}]
[{"$nulls":9},"PROT ENERGÍA COMERCIALIZACIÓN, S.L.",{"$nulls":3},{"v":0,"d":"0.00"}]
[{"$nulls":9},"PULSAR SERVICIOS ENERGÉTICOS,",{"$nulls":3},{"v":0,"d":"0.00"}]
[{"$nulls":9},"REMICA COMERCIALIZADORA, S.A.U.",{"$nulls":3},{"v":0.23999999463558197,"d":"0.24"}]
[{"$nulls":9},"RENEWABLE VENTURES, S.L.",{"$nulls":3},{"v":0,"d":"0.00"}]
[{"$nulls":9},"RESPIRA ENERGÍA, S.A.",{"$nulls":3},{"v":0.029999999329447746,"d":"0.03"}]
[{"$nulls":9},"RESPIRA ENERGÍA ESPAÑA, S.L. ",{"$nulls":3},{"v":0.3700000047683716,"d":"0.37"}]
[{"$nulls":9},"RTOTAL GAS Y ELECTRICIDAD ESPAÑA, S.A.U.",{"$nulls":3},{"v":0.36000001430511475,"d":"0.36"}]
[{"$nulls":9},"SAMPOL INGENIERÍA Y OBRAS, S.A.",{"$nulls":3},{"v":0.33000001311302185,"d":"0.33"}]
[{"$nulls":9},"SHELL ESPAÑA, S.A.",{"$nulls":3},{"v":0,"d":"0.00"}]
[{"$nulls":9},"SOM ENERGÍA, S.C.C.L.",{"$nulls":3},{"v":0,"d":"0.00"}]
[{"$nulls":9},"STIN, S.A.",{"$nulls":3},{"v":0.38999998569488525,"d":"0.39"}]
[{"$nulls":9},"SUMINISTRADORA ELECTRICA VIENTOS ALISIOS DE LANZAROTE S.L.",{"$nulls":3},{"v":0,"d":"0.00"}]
[{"$nulls":9},"SUMINISTROS ESPECIALES ALGINETENSES COOP. V.",{"$nulls":3},{"v":0,"d":"0.00"}]
[{"$nulls":9},"SUNAIR ONE ENERGY, S.L.",{"$nulls":3},{"v":0.3799999952316284,"d":"0.38"}]
[{"$nulls":9},"SUNAIR ONE HOME, S.L.",{"$nulls":3},{"v":0.20000000298023224,"d":"0.20"}]
[{"$nulls":9},"SYDER COMERCIALIZADORA VERDE, S.L.",{"$nulls":3},{"v":0,"d":"0.00"}]
[{"$nulls":9},"TELEFONICA SOLUCIONES DE INFORMATICA Y COMUNICACIONES DE ESPAÑA, S.A.U.",{"$nulls":3},{"v":0.20000000298023224,"d":"0.20"}]
[{"$nulls":9},"THE YELLOW ENERGY, S.L.",{"$nulls":3},{"v":0,"d":"0.00"}]
[{"$nulls":9},"TOTAL GAS Y ELECTRICIDAD ESPAÑA S.A.U.",{"$nulls":3},{"v":0.3799999952316284,"d":"0.38"}]
[{"$nulls":9},"TRACTAMENT I SELECCIÓ DE RESIDUS, S.A.",{"$nulls":3},{"v":0,"d":"0.00"}]
[{"$nulls":9},"TRADE UNIVERSAL ENERGY, S.A.",{"$nulls":3},{"v":0,"d":"0.00"}]
[{"$nulls":9},"UNIELÉCTRICA ENERGÍA, S.A.",{"$nulls":3},{"v":0,"d":"0.00"}]
[{"$nulls":9},"V3J INGENIERIA Y SERVICIOS, S.L.",{"$nulls":3},{"v":0.30000001192092896,"d":"0.30"}]
[{"$nulls":9},"VIESGO ENERGÍA, S.L.",{"$nulls":3},{"v":0.20999999344348907,"d":"0.21"}]
[{"$nulls":9},"VIRTUS GLOBAL ENERGY SL",{"$nulls":3},{"v":0,"d":"0.00"}]
[{"$nulls":9},"VIVE ENERGÍA ELÉCTRICA, S.A",{"$nulls":3},{"v":0.4099999964237213,"d":"0.41"}]
[{"$nulls":9},"WATIO WHOLESALE, S.L.",{"$nulls":3},{"v":0.38999998569488525,"d":"0.39"}]
[{"$nulls":9},"WATIUM, S.L.",{"$nulls":3},{"v":0.3499999940395355,"d":"0.35"}]
[{"$nulls":9},"WIND TO MARKET, S.A.",{"$nulls":3},{"v":0.20000000298023224,"d":"0.20"}]
[{"$nulls":9},"https://gdo.cnmc.es/CNE/resumenGdo.do?anio=2018"]
[{"$nulls":4},2019]
[{"$nulls":4},"Mix de comercializadoras sin GdO para 2019"]
[{"$nulls":4},{"v":0.3100000023841858,"d":"0.31"},"kg CO2/kWh"]
[]
[{"$nulls":4},"Comercializadora",null,null,"Factor Mix 2019\n(kg CO2/kWh)"]
[{"$nulls":4},"ACCIÓN ENERGÍA COMERCIALIZADORA, S.L.",null,null,{"v":0,"d":"0.00"}]
[{"$nulls":4},"ACCIONA GREEN ENERGY DEVELOPMENTS, S.L.",null,null,{"v":0,"d":"0.00"}]
[{"$nulls":4},"ACSOL ENERGÍA GLOBAL, S.A.",null,null,{"v":0.28999999165534973,"d":"0.29"}]
[{"$nulls":4},"ADEINNOVA ENERGÍA, S.L.U.",null,null,{"v":0.11999999731779099,"d":"0.12"}]
[{"$nulls":4},"ADELFAS ENERGÍA, S.L.",null,null,{"v":0.03999999910593033,"d":"0.04"}]
[{"$nulls":4},"ADS ENERGY 8,0, S.L.",null,null,{"v":0,"d":"0.00"}]
[{"$nulls":4},"ADURIZ ENERGÍA, S.L.U.",null,null,{"v":0,"d":"0.00"}]
[{"$nulls":4},"AGENTE DEL MERCADO ELÉCTRICO, S.A.",null,null,{"v":0.27000001072883606,"d":"0.27"}]
[{"$nulls":4},"AGRI-ENERGÍA, S.A.",null,null,{"v":0,"d":"0.00"}]
[{"$nulls":4},"AGUAS DE BARBASTRO ENERGÍA, S.L.",null,null,{"v":0.3100000023841858,"d":"0.31"}]
[{"$nulls":4},"AHORRELUZ SERVICIOS ONLINE S.L",null,null,{"v":0,"d":"0.00"}]
[{"$nulls":4},"AHORRO ENERGÍA HOGAR INVESTMENTS, S.L.",null,null,{"v":0.3100000023841858,"d":"0.31"}]
[{"$nulls":4},"ALCANZIA ENERGÍA, S.L.",null,null,{"v":0,"d":"0.00"}]
[{"$nulls":4},"ALDRO ENERGÍA Y SOLUCIONES, S.L.U.",null,null,{"v":0.30000001192092896,"d":"0.30"}]
[{"$nulls":4},"ALPEX IBERICA DE ENERGÍA, S.L.U",null,null,{"v":0,"d":"0.00"}]
[{"$nulls":4},"ALPIQ ENERGÍA ESPAÑA, S.A.U.",null,null,{"v":0.18000000715255737,"d":"0.18"}]
[{"$nulls":4},"ANOTHER ENERGY OPTION, S.L.",null,null,{"v":0,"d":"0.00"}]
[{"$nulls":4},"AQUÍ ENERGÍA, S.L.",null,null,{"v":0,"d":"0.00"}]
[{"$nulls":4},"ASAL DE ENERGÍA, S.L. ",null,null,{"v":0,"d":"0.00"}]
[{"$nulls":4},"ATLAS ENERGÍA COMERCIAL, S.L.",null,null,{"v":0.2800000011920929,"d":"0.28"}]
[{"$nulls":4},"AUDAX ENERGÍA, S.L.U.",null,null,{"v":0,"d":"0.00"}]
[{"$nulls":4},"AURA ENERGÍA, S.L.",null,null,{"v":0,"d":"0.00"}]
[{"$nulls":4},"AUSARTA PRIMA, S.L.",null,null,{"v":0,"d":"0.00"}]
[{"$nulls":4},"AVANZALIA ENERGÍA COMERCIALIZADORA, S.A.",null,null,{"v":0.1899999976158142,"d":"0.19"}]
[{"$nulls":4},"AXPO IBERIA, S.L.",null,null,{"v":0,"d":"0.00"}]
[{"$nulls":4},"BASSOLS ENERGÍA COMERCIAL, S.L.",null,null,{"v":0,"d":"0.00"}]
[{"$nulls":4},"BEYOND SUN SL",null,null,{"v":0,"d":"0.00"}]
[{"$nulls":4},"BSG ENERGÍA S.L.",null,null,{"v":0.28999999165534973,"d":"0.29"}]
[{"$nulls":4},"BULB ENERGÍA IBERICA, S.L.",null,null,{"v":0,"d":"0.00"}]
[{"$nulls":4},"CATGAS ENERGÍA, S.A.",null,null,{"v":0,"d":"0.00"}]
[{"$nulls":4},"CEPSA COMERCIAL PETRÓLEO,\r S.A.U.",null,null,{"v":0,"d":"0.00"}]
[{"$nulls":4},"CEPSA GAS Y ELECTRICIDAD, S.A.",null,null,{"v":0,"d":"0.00"}]
[{"$nulls":4},"CIDE HCENERGÍA S.A.",null,null,{"v":0.3100000023841858,"d":"0.31"}]
[{"$nulls":4},"CLIDOM ENERGY, S.L.",null,null,{"v":0,"d":"0.00"}]
[{"$nulls":4},"COMERCIALIZADORA DE ELECTRICIDAD Y GAS DEL MEDITERRÁNEO, S.L.",null,null,{"v":0,"d":"0.00"}]
[{"$nulls":4},"COMERCIALIZADORA ELECTRICA DE CADIZ, S.A.",null,null,{"v":0,"d":"0.00"}]
[{"$nulls":4},"COMERCIALIZADORA ELECTRICA PENINSULAR, S.L.",null,null,{"v":0.3100000023841858,"d":"0.31"}]
[{"$nulls":4},"COMERCIALIZADORA ELÉCTRICA TALAYUELAS, S.L.",null,null,{"v":0.07000000029802322,"d":"0.07"}]
[{"$nulls":4},"COMERCIALIZADORA ENERGÉTICA SOSTENIBLE, S.A.U.",null,null,{"v":0,"d":"0.00"}]
[{"$nulls":4},"COMERCIALIZADORA LERSA , S.L.",null,null,{"v":0.009999999776482582,"d":"0.01"}]
[{"$nulls":4},"COMPAÑÍA ESCANDINAVA DE ELECTRICIDAD EN ESPAÑA, S.L.",null,null,{"v":0,"d":"0.00"}]
[{"$nulls":4},"COOPERATIVA ELÉCTRICA BENÉFICA CATRALENSE, COOP. V.",null,null,{"v":0,"d":"0.00"}]
[{"$nulls":4},"COOPERATIVA ELÉCTRICA BENÉFICA SAN FRANCISCO DE ASÍS, COOP. V.",null,null,{"v":0.009999999776482582,"d":"0.01"}]
[{"$nulls":4},"COOPERATIVA ELECTRICA DE CASTELLAR, S.C.V.",null,null,{"v":0,"d":"0.00"}]
[{"$nulls":4},"COOPERATIVA ELÉCTRICA-BENÉFICA ALBATERENSE, COOP.V.",null,null,{"v":0,"d":"0.00"}]
[{"$nulls":4},"COOPERATIVA VALENCIANA ELECTRODISTRIBUIDORA DE FUERZA Y ALUMBRADO SERRALLO, S.Coop.V.",null,null,{"v":0,"d":"0.00"}]
[{"$nulls":4},"COX ENERGÍA COMERCIALIZADORA ESPAÑA, S.L.U.",null,null,{"v":0,"d":"0.00"}]
[{"$nulls":4},"CYE ENERGÍA, S.L.",null,null,{"v":0,"d":"0.00"}]
[{"$nulls":4},"DAIMUZ ENERGÍA, S.L.",null,null,{"v":0,"d":"0.00"}]
[{"$nulls":4},"DISA ENERGÍA ELÉCTRICA, S.L.U.",null,null,{"v":0,"d":"0.00"}]
[{"$nulls":4},"DREUE ELECTRIC, S.L.",null,null,{"v":0.2800000011920929,"d":"0.28"}]
[{"$nulls":4},"DRK ENERGY, S.L.",null,null,{"v":0.23000000417232513,"d":"0.23"}]
[{"$nulls":4},"ECOEQ ENERGÉTICA, S.L.",null,null,{"v":0.1599999964237213,"d":"0.16"}]
[{"$nulls":4},"ECOFUTURA LUZ ENERGÍA, S.L.",null,null,{"v":0.30000001192092896,"d":"0.30"}]
[{"$nulls":4},"ECONACTIVA, S. COOP DE C-LM",null,null,{"v":0,"d":"0.00"}]
[{"$nulls":4},"EDP COMERCIALIZADORA, S.A.U.",null,null,{"v":0.23000000417232513,"d":"0.23"}]
[{"$nulls":4},"EDP ENERGÍA, S.A.U.",null,null,{"v":0.11999999731779099,"d":"0.12"}]
[{"$nulls":4},"ELECNOVA SIGLO XXI, S.L.",null,null,{"v":0,"d":"0.00"}]
[{"$nulls":4},"ELECTRA AVELLANA COMERCIAL, S.L.",null,null,{"v":0,"d":"0.00"}]
[{"$nulls":4},"ELECTRA CALDENSE ENERGÍA, S.A.",null,null,{"v":0,"d":"0.00"}]
[{"$nulls":4},"ELECTRA DEL CARDENER ENERGÍA, S.A.",null,null,{"v":0,"d":"0.00"}]
[{"$nulls":4},"ELECTRA ENERGÍA, S.A.U.",null,null,{"v":0,"d":"0.00"}]
[{"$nulls":4},"ELECTRA NORTE ENERGÍA, S.A.U.",null,null,{"v":0.28999999165534973,"d":"0.29"}]
[{"$nulls":4},"ELECTRICA ALBATERENSE, S.L.",null,null,{"v":0,"d":"0.00"}]
[{"$nulls":4},"ELECTRICA CATRALENSE, S.L.",null,null,{"v":0,"d":"0.00"}]
[{"$nulls":4},"ELECTRICA DE CHERA, S.C.V.",null,null,{"v":0,"d":"0.00"}]
[{"$nulls":4},"ELECTRICA DE GUADASSUAR COOP. V.",null,null,{"v":0,"d":"0.00"}]
[{"$nulls":4},"ELECTRICA DE GUIXES ENERGÍA, S.L.",null,null,{"v":0.18000000715255737,"d":"0.18"}]
[{"$nulls":4},"ELÉCTRICA DE MELIANA, S.C.V.",null,null,{"v":0,"d":"0.00"}]
[{"$nulls":4},"ELÉCTRICA DE SOT DE CHERA S. COOP.V.",null,null,{"v":0,"d":"0.00"}]
[{"$nulls":4},"ELECTRICA SEROSENSE, S.L.",null,null,{"v":0.28999999165534973,"d":"0.29"}]
[{"$nulls":4},"ELECTRICA SOLLERENSE, S.A.",null,null,{"v":0,"d":"0.00"}]
[{"$nulls":4},"ELECTRICA VAQUER ENERGÍA, S.A.",null,null,{"v":0,"d":"0.00"}]
[{"$nulls":4},"ELECTRICA VINALESA SDAD COOP VALENCIANA",null,null,{"v":0,"d":"0.00"}]
[{"$nulls":4},"ELÉCTRICAS HIDROBESORA, S.L.",null,null,{"v":0,"d":"0.00"}]
[{"$nulls":4},"ELECTRICIDAD ELEIA S.L.",null,null,{"v":0,"d":"0.00"}]
[{"$nulls":4},"ELEKTRON COMERCIALIZADORA DE ENERGÍA, S.L.",null,null,{"v":0.23999999463558197,"d":"0.24"}]
[{"$nulls":4},"ELEVA 2 COMERCIALIZADORA, S.L.",null,null,{"v":0,"d":"0.00"}]
[{"$nulls":4},"EMASP, S. COOP.",null,null,{"v":0,"d":"0.00"}]
[{"$nulls":4},"ENARA GESTIÓN Y MEDIACIÓN, S.L.",null,null,{"v":0,"d":"0.00"}]
[{"$nulls":4},"ENDESA ENERGÍA, S.A.",null,null,{"v":0.27000001072883606,"d":"0.27"}]
[{"$nulls":4},"ENDESA GENERACIÓN, S.A.",null,null,{"v":0.3100000023841858,"d":"0.31"}]
[{"$nulls":4},"ENDI ENERGY TRADING, S.L.",null,null,{"v":0,"d":"0.00"}]
[{"$nulls":4},"ENELUZ 2025, S.L.",null,null,{"v":0,"d":"0.00"}]
[{"$nulls":4},"ENERCOLUZ ENERGÍA, S.L.",null,null,{"v":0.25999999046325684,"d":"0.26"}]
[{"$nulls":4},"ENERGÉTICA DEL ESTE, S.L.",null,null,{"v":0,"d":"0.00"}]
[{"$nulls":4},"ENERGÍA COLECTIVA, S.L.",null,null,{"v":0,"d":"0.00"}]
[{"$nulls":4},"ENERGÍA DLR COMERCIALIZADORA, S.L.",null,null,{"v":0.30000001192092896,"d":"0.30"}]
[{"$nulls":4},"ENERGÍA ELÉCTRICA EFICIENTE, S.L",null,null,{"v":0,"d":"0.00"}]
[{"$nulls":4},"ENERGÍA NARANJA, S.L.",null,null,{"v":0,"d":"0.00"}]
[{"$nulls":4},"ENERGÍA NUFRI, S.L.U.",null,null,{"v":0.25999999046325684,"d":"0.26"}]
[{"$nulls":4},"ENERGÍA VIVA SPAIN, S.L.",null,null,{"v":0.27000001072883606,"d":"0.27"}]
[{"$nulls":4},"ENERGY STROM XXI, S.L.",null,null,{"v":0.10000000149011612,"d":"0.10"}]
[{"$nulls":4},"ENÉRGYA VM GESTIÓN DE ENERGÍA, S.L.U.",null,null,{"v":0.17000000178813934,"d":"0.17"}]
[{"$nulls":4},"ENERPLUS, S.COOP.",null,null,{"v":0,"d":"0.00"}]
[{"$nulls":4},"ENGIE ESPAÑA, S.L.U.",null,null,{"v":0.25999999046325684,"d":"0.26"}]
[{"$nulls":4},"ENSTROGA, S.L.",null,null,{"v":0.30000001192092896,"d":"0.30"}]
[{"$nulls":4},"ESTABANELL Y PAHISA MERCATOR, S.A.",null,null,{"v":0,"d":"0.00"}]
[{"$nulls":4},"ESTRATEGIAS ELÉCTRICAS INTEGRALES, S.A.",null,null,{"v":0.17000000178813934,"d":"0.17"}]
[{"$nulls":4},"EVERGREEN ELÉCTRICA, S.L.",null,null,{"v":0.3100000023841858,"d":"0.31"}]
[{"$nulls":4},"FACTOR ENERGÍA, S.A.",null,null,{"v":0.20999999344348907,"d":"0.21"}]
[{"$nulls":4},"FAIN Energía S.L.",null,null,{"v":0,"d":"0.00"}]
[{"$nulls":4},"FENIE ENERGÍA, S.A.",null,null,{"v":0,"d":"0.00"}]
[{"$nulls":4},"Foener Energía, S.L",null,null,{"v":0.2800000011920929,"d":"0.28"}]
[{"$nulls":4},"FORZA VSUNAIR, S.L.",null,null,{"v":0,"d":"0.00"}]
[{"$nulls":4},"FOX ENERGÍA, S.A.",null,null,{"v":0.3100000023841858,"d":"0.31"}]
[{"$nulls":4},"FUSIONA COMERCIALIZADORA, S.A.",null,null,{"v":0,"d":"0.00"}]
[{"$nulls":4},"GAIA GLOBAL ENERGY SOCIEDAD LIMITADA",null,null,{"v":0,"d":"0.00"}]
[{"$nulls":4},"GALP ENERGÍA ESPAÑA S.A.U.",null,null,{"v":0.27000001072883606,"d":"0.27"}]
[{"$nulls":4},"GAOLANIA SERVICIOS, S.L.",null,null,{"v":0,"d":"0.00"}]
[{"$nulls":4},"GAS NATURAL COMERCIALIZADORA, S.A.",null,null,{"v":0.20999999344348907,"d":"0.21"}]
[{"$nulls":4},"GEO ALTERNATIVA, S.L.",null,null,{"v":0,"d":"0.00"}]
[{"$nulls":4},"GEOATLANTER, S.L.",null,null,{"v":0,"d":"0.00"}]
[{"$nulls":4},"GERENTA ENERGÍA, S.L.U",null,null,{"v":0,"d":"0.00"}]
[{"$nulls":4},"GESTERNOVA, S.A.",null,null,{"v":0,"d":"0.00"}]
[{"$nulls":4},"GLOBAL BIOSFERA PROTEC, S.L.",null,null,{"v":0,"d":"0.00"}]
[{"$nulls":4},"GLOBELIGHT ENERGY S.L",null,null,{"v":0.2199999988079071,"d":"0.22"}]
[{"$nulls":4},"GNERA ENERGÍA Y TECNOLOGIA, S.L.",null,null,{"v":0,"d":"0.00"}]
[{"$nulls":4},"GOIENER S.COOP",null,null,{"v":0,"d":"0.00"}]
[{"$nulls":4},"GRUPO IBERSOGAS ENERGÍA, S.L.",null,null,{"v":0.3100000023841858,"d":"0.31"}]
[{"$nulls":4},"HELIA COOP V",null,null,{"v":0,"d":"0.00"}]
[{"$nulls":4},"HELIOELEC ENERGÍA ELECTRICA, S.L.",null,null,{"v":0,"d":"0.00"}]
[{"$nulls":4},"HIDROELECTRICA DEL VALIRA, S.L.",null,null,{"v":0,"d":"0.00"}]
[{"$nulls":4},"HIDROELÉCTRICA EL CARMEN ENERGÍA, S.L.",null,null,{"v":0,"d":"0.00"}]
[{"$nulls":4},"IBERCOEN ENERGÍA, S.A.",null,null,{"v":0,"d":"0.00"}]
[{"$nulls":4},"IBERDROLA CLIENTES, S.A.U.",null,null,{"v":0.20000000298023224,"d":"0.20"}]
[{"$nulls":4},"IBERDROLA GENERACION ESPAÑA, S.A.U.",null,null,{"v":0,"d":"0.00"}]
[{"$nulls":4},"IBERDROLA SERVICIOS ENERGETICOS, S.A.U.",null,null,{"v":0,"d":"0.00"}]
[{"$nulls":4},"IBERELECTRICA COMERCIALIZADORA, S.L.",null,null,{"v":0.3100000023841858,"d":"0.31"}]
[{"$nulls":4},"IM3 ENERGÍA, S.L.",null,null,{"v":0,"d":"0.00"}]
[{"$nulls":4},"INDEXO ENERGÍA, S.L.",null,null,{"v":0.12999999523162842,"d":"0.13"}]
[{"$nulls":4},"INER ENERGÍA CASTILLA LA MANCHA, S.L.",null,null,{"v":0.28999999165534973,"d":"0.29"}]
[{"$nulls":4},"INICIATIVA E. NOVA, S.L.",null,null,{"v":0,"d":"0.00"}]
[{"$nulls":4},"INNOVA DESARROLLO Y EFICIENCIA ENERGÉTICA, S.L.",null,null,{"v":0,"d":"0.00"}]
[{"$nulls":4},"INTEGRACIÓN EUROPEA DE ENERGÍA, S.A.U.",null,null,{"v":0.3100000023841858,"d":"0.31"}]
[{"$nulls":4},"INTEGRACION EUROPEA DE ENERGÍA SUR, S.L.",null,null,{"v":0.30000001192092896,"d":"0.30"}]
[{"$nulls":4},"INTELIGENCIA PARA EL AHORRO ENERGÉTICO, S.L.",null,null,{"v":0,"d":"0.00"}]
[{"$nulls":4},"KILOWATIOS VERDES, S.L.",null,null,{"v":0.10999999940395355,"d":"0.11"}]
[{"$nulls":4},"KISHOA, S.L.",null,null,{"v":0,"d":"0.00"}]
[{"$nulls":4},"LA CORRIENTE SOCIEDAD COOPERATIVA",null,null,{"v":0,"d":"0.00"}]
[{"$nulls":4},"LA UNION ELECTRO INDUSTRIAL, S.L.U.",null,null,{"v":0,"d":"0.00"}]
[{"$nulls":4},"LONJAS TECNOLOGIA, S.A.",null,null,0.25]
[{"$nulls":4},"LOOP ELECTRICIDAD Y GAS S.L.",null,null,{"v":0,"d":"0.00"}]
[{"$nulls":4},"LUBALOO, S.L.",null,null,{"v":0,"d":"0.00"}]
[{"$nulls":4},"LUX FORUM SL",null,null,{"v":0.2800000011920929,"d":"0.28"}]
[{"$nulls":4},"MEGARA ENERGÍA SOCIEDAD COOPERATIVA CYL",null,null,{"v":0,"d":"0.00"}]
[{"$nulls":4},"MULTIENERGÍA VERDE, S.L.",null,null,{"v":0,"d":"0.00"}]
[{"$nulls":4},"NABALIA ENERGÍA 2000, S.A.",null,null,{"v":0.14000000059604645,"d":"0.14"}]
[{"$nulls":4},"NATURGY IBERIA, S.A.",null,null,{"v":0.30000001192092896,"d":"0.30"}]
[{"$nulls":4},"NATURGY RENOVABLES, S.L.U.",null,null,{"v":0,"d":"0.00"}]
[{"$nulls":4},"NEOWATIO, S.L.",null,null,{"v":0,"d":"0.00"}]
[{"$nulls":4},"NEXUS ENERGÍA, S.A.",null,null,{"v":0,"d":"0.00"}]
[{"$nulls":4},"NINOBE SERVICIOS ENERGÉTICOS, S.L.",null,null,{"v":0.28999999165534973,"d":"0.29"}]
[{"$nulls":4},"NOBE SOLUCIONES Y ENERGÍA",null,null,{"v":0,"d":"0.00"}]
[{"$nulls":4},"NOSA ENERXIA SOCIEDADE COOP GALEGA",null,null,{"v":0,"d":"0.00"}]
[{"$nulls":4},"ODF ENERGÍA LIBRE COMERCIALIZADORA, S.L.",null,null,{"v":0,"d":"0.00"}]
[{"$nulls":4},"ON DEMAND FACILITIES, S.L.U.",null,null,{"v":0,"d":"0.00"}]
[{"$nulls":4},"OVO ENERGY SPAIN, S.L.",null,null,{"v":0,"d":"0.00"}]
[{"$nulls":4},"PEPEENERGY",null,null,{"v":0,"d":"0.00"}]
[{"$nulls":4},"PETRO NAVARRA, S.L.",null,null,{"v":0,"d":"0.00"}]
[{"$nulls":4},"PHOTON GESTIÓN",null,null,{"v":0,"d":"0.00"}]
[{"$nulls":4},"POTENZIA COMERCIALIZADORA, S.L.",null,null,{"v":0,"d":"0.00"}]
[{"$nulls":4},"PROT ENERGÍA COMERCIALIZACIÓN, S.L.",null,null,{"v":0,"d":"0.00"}]
[{"$nulls":4},"PULSAR SERVICIOS ENERGÉTICOS",null,null,{"v":0,"d":"0.00"}]
[{"$nulls":4},"REMICA COMERCIALIZADORA, S.A.U.",null,null,{"v":0.20999999344348907,"d":"0.21"}]
[{"$nulls":4},"RENEWABLE VENTURES, S.L.",null,null,{"v":0,"d":"0.00"}]
[{"$nulls":4},"REPSOL COMERCIALIZADORA DE ELECTRICIDAD Y GAS, S.L.U.",null,null,{"v":0.019999999552965164,"d":"0.02"}]
[{"$nulls":4},"RESPIRA ENERGÍA ESPAÑA, S.L. ",null,null,{"v":0.3100000023841858,"d":"0.31"}]
[{"$nulls":4},"RESPIRA ENERGÍA, S.A.",null,null,{"v":0.05000000074505806,"d":"0.05"}]
[{"$nulls":4},"ROFEICA ENERGÍA, S.A",null,null,{"v":0.30000001192092896,"d":"0.30"}]
[{"$nulls":4},"RONDA OESTE ENERGÍA, S.L.",null,null,{"v":0.28999999165534973,"d":"0.29"}]
[{"$nulls":4},"SAMPOL INGENIERÍA Y OBRAS, S.A.",null,null,{"v":0.18000000715255737,"d":"0.18"}]
[{"$nulls":4},"SHELL ESPAÑA, S.A.",null,null,{"v":0,"d":"0.00"}]
[{"$nulls":4},"SOM ENERGÍA, S.C.C.L.",null,null,{"v":0,"d":"0.00"}]
[{"$nulls":4},"STIN, S.A.",null,null,{"v":0.23999999463558197,"d":"0.24"}]
[{"$nulls":4},"SUMINISTRADORA ELECTRICA VIENTOS ALISIOS DE LANZAROTE, S.L.",null,null,{"v":0,"d":"0.00"}]
[{"$nulls":4},"SUMINISTROS ESPECIALES ALGINETENSES COOP. V.",null,null,{"v":0,"d":"0.00"}]
[{"$nulls":4},"SUNAIR ONE ENERGY, S.L.",null,null,{"v":0,"d":"0.00"}]
[{"$nulls":4},"SUNAIR ONE HOME, S.L.",null,null,{"v":0,"d":"0.00"}]
[{"$nulls":4},"SYDER COMERCIALIZADORA VERDE, S.L.",null,null,{"v":0,"d":"0.00"}]
[{"$nulls":4},"TELEFONICA SOLUCIONES DE INFORMATICA Y COMUNICACIONES DE ESPAÑA, S.A.U.",null,null,{"v":0,"d":"0.00"}]
[{"$nulls":4},"TERUGAS ENERGY, S.L.",null,null,{"v":0,"d":"0.00"}]
[{"$nulls":4},"THE ENERGY HOUSE GROUP, S.L.",null,null,{"v":0,"d":"0.00"}]
[{"$nulls":4},"THE YELLOW ENERGY, S.L.",null,null,{"v":0,"d":"0.00"}]
[{"$nulls":4},"TOTAL GAS Y ELECTRICIDAD ESPAÑA, S.A.U.",null,null,{"v":0.30000001192092896,"d":"0.30"}]
[{"$nulls":4},"TRACTAMENT I SELECCIÓ DE RESIDUS, S.A.",null,null,{"v":0,"d":"0.00"}]
[{"$nulls":4},"TRADE UNIVERSAL ENERGY, S.A.",null,null,{"v":0,"d":"0.00"}]
[{"$nulls":4},"UNIELÉCTRICA ENERGÍA, S.A.",null,null,{"v":0,"d":"0.00"}]
[{"$nulls":4},"VIRTUS GLOBAL ENERGY, S.L.",null,null,{"v":0,"d":"0.00"}]
[{"$nulls":4},"VISALIA ENERGÍA, S.L.",null,null,{"v":0,"d":"0.00"}]
[{"$nulls":4},"VIVE ENERGÍA ELÉCTRICA, S.A.",null,null,{"v":0,"d":"0.00"}]
[{"$nulls":4},"VIVO ENERGÍA FUTURA, S.A.",null,null,{"v":0,"d":"0.00"}]
[{"$nulls":4},"VÓLTICO ENERGÍA, S.L.",null,null,{"v":0,"d":"0.00"}]
[{"$nulls":4},"V3J INGENIERIA Y SERVICIOS, S.L.",null,null,{"v":0.05000000074505806,"d":"0.05"}]
[{"$nulls":4},"WATIO WHOLESALE, S.L.",null,null,{"v":0.27000001072883606,"d":"0.27"}]
[{"$nulls":4},"WATIUM, S.L.",null,null,{"v":0.2800000011920929,"d":"0.28"}]
[{"$nulls":4},"WIND TO MARKET, S.A.",null,null,{"v":0.20999999344348907,"d":"0.21"}]
[{"$nulls":4},"24-7 UTILITIES, S.L.U.",null,null,{"v":0,"d":"0.00"}]
[{"$nulls":4},"https://gdo.cnmc.es/CNE/resumenGdo.do?anio=2019"]

{"sheet":"8. Observaciones","index":8,"n_rows":107,"n_cols":11,"rows_kept":107,"merged":[[0,2,0,15],[2,1,2,14],[4,2,4,14],[6,2,6,14],[10,2,10,14],[12,2,12,14],[14,2,14,14],[15,5,15,9],[16,5,16,6],[16,7,16,8],[17,5,17,6],[17,7,17,8],[19,2,19,14],[23,1,23,14],[25,2,25,14],[27,2,27,14],[28,3,29,7],[28,8,28,9],[28,10,29,13],[30,3,30,7],[30,10,30,13],[31,3,31,7],[31,10,31,13],[32,3,32,7],[32,10,32,13],[33,2,35,14],[37,3,38,7],[37,8,37,9],[37,10,38,13],[39,3,39,7],[39,10,39,13],[40,3,40,7],[40,10,40,13],[41,3,41,7],[41,10,41,13],[43,2,43,14],[45,2,45,14],[47,2,47,14],[49,2,49,14],[51,2,51,14],[53,3,54,7],[53,8,53,9],[53,10,54,13],[55,3,55,7],[55,10,55,13],[56,3,56,7],[56,10,56,13],[57,3,57,7],[57,10,57,13],[59,2,59,14],[61,2,61,14],[62,2,62,14],[64,2,64,14],[65,2,65,14],[67,2,67,14],[68,2,70,14],[72,1,72,14],[74,2,74,14],[76,2,79,14],[80,2,80,14],[81,2,81,14],[84,1,84,14],[86,2,86,14],[88,2,88,14],[90,2,90,14],[91,2,91,14],[92,2,92,14],[93,2,93,14],[94,2,94,14],[96,2,96,14],[98,2,98,14],[99,2,99,14],[102,1,102,14],[104,2,104,14],[106,2,106,14]]}
[null,null,"                                  OBSERVACIONES / EXPLICACIONES. AYUDA PARA LA CORRECTA CUMPLIMENTACIÓN"]
[]
[null,"1.    OBSERVACIONES: DATOS GENERALES DE LA ORGANIZACIÓN"]
[]
[null,null,"1 En caso de tratarse de una empresa, el tamaño de la misma se establece en base a la Recomendación 2003/361/CE de la Comisión (Diario Oficial L 124 de 20.5.2003).\n\n"]
[]
[null,null,"http://eur-lex.europa.eu/LexUriServ/LexUriServ.do?uri=OJ:L:2003:124:0036:0041:es:PDF"]
[]
[null,null,"2 CNAE 2009: Clasificación nacional de actividades económicas"]
[]
[null,null,"3 Años anteriores al año para el que se está calculando la huella de carbono de la organización. En caso de que se calcule la huella de carbono por primera vez, estas celdas no podrán rellenarse."]
[]
[null,null,"4 En caso de haber calculado la huella de carbono en años anteriores, indicar su valor expresado en t CO2 en estas celdas."]
[]
[null,null,"5 Índice que la organización considere representativo como indicador de su nivel de actividad (nombre del parámetro, dato numérico y unidades en las que se expresa). Este índice estará referido al año de estudio y será función del sector al que pertenezca la organización, como ejemplos se citan: facturación, nº de proyectos, nº de servicios realizados, nº de productos vendidos, etc."]
[{"$nulls":4},"Ejemplo:","Otro índice"]
[{"$nulls":5},"Nombre",null,"Valor numérico",null,"Unidades"]
[{"$nulls":5},"Proyectos realizados durante el año",null,27,null,"proyectos"]
[]
[null,null,"6  Valor medio de la superficie y del nº de empleados para los meses contemplados en el año de estudio. Son datos referidos a las instalaciones de la organización consideradas dentro del alcance (oficinas, naves, almacenes, etc.)."]
[]
[]
[]
[null,"2.    OBSERVACIONES: COMBUSTIBLES FÓSILES"]
[]
[null,null,"1 En caso de que las instalaciones emisoras se ubiquen en diferentes lugares (edificios / sedes) y disponga de los datos de consumo desagregados en función de los mismos, si lo desea, puede especificar en esta celda cuáles son y en la hoja 6_Resultados se reflejará el total de emisiones de alcance 1 y alcance 2 asociadas a cada uno de ellos.Tenga en cuenta que si el nombre de una sede aparece varias veces, éste ha de estar escrito exactamente de la misma manera. En caso contrario, el desglose de resultados según sedes será incorrecto.\n"]
[]
[null,null,"2 Si no se dispone del dato en las unidades indicadas, será necesario realizar las conversiones correspondientes. Por ejemplo, para el caso del gas butano, si no se dispone del dato en kg sino en nº de bombonas, habrá que calcular los kg a partir del dato de la capacidad de las mismas. En caso de utilizar factores de conversión, indicar en el cuadro expuesto a continuación la siguiente información:"]
[{"$nulls":3},"Combustible",{"$nulls":4},"Factor de conversión",null,"Fuente de información"]
[{"$nulls":8},"Valor","Unidades"]
[]
[]
[]
[null,null,"En el caso en que se utilicen otros combustibles diferentes a los indicados en la lista desplegable, ha de seleccionarse la opción \"Otros\" e introducir el factor de emisión correspondiente teniendo en cuenta que las unidades respecto a las que se exprese (kg de CO2/ud.) sean coincidentes con las unidades en las que se cuantifique la cantidad de combustible consumido. Será necesario indicar en el siguiente cuadro el nombre del combustible, la fuente de donde se extrae su factor de emisión así como su valor y unidades:"]
[]
[]
[]
[{"$nulls":3},"Combustible",{"$nulls":4},"Factor de emisión ",null,"Fuente de información"]
[{"$nulls":8},"Valor","Unidades"]
[]
[]
[]
[]
[null,null,"3 Cantidad de combustible consumido expresado en las unidades indicadas en la columna anterior. \nTenga en cuenta que si el combustible utilizado es el gas natural, el factor de emisión está expresado respecto al PCI y, por tanto, si el dato de consumo (kWh) de su factura viene expresado en PCS, deberá realizar la conversión correspondiente: 1 kWh(PCI) = 0,901 kWh(PCS)."]
[]
[null,null,"4 Factor de emisión correspondiente al combustible seleccionado que aparece por defecto a excepción de haber seleccionado la opción “Otros” en cuyo caso, habrá que introducir el factor de emisión correspondiente indicando en el cuadro anterior, el nombre del combustible, la fuente de donde se extrae su factor de emisión así como su valor y unidades. Es imprescindible que las unidades respecto a las que se refiere el factor de emisión (kg CO2/ud) sean coincidentes con las unidades en las que se cuantifique la cantidad de combustible consumido."]
[]
[null,null,"5 Únicamente será necesario cumplimentar una de las dos opciones (B.1 o B.2) en función de los datos disponibles."]
[]
[null,null,"6 Si lo desea puede en esta celda especificar el vehículo o la flota de vehículos según tipo de combustible. En caso de vehículos eléctricos deberá cumplimentar los datos en la pestaña 4_Electricidad."]
[]
[null,null,"7 Los vehículos pueden ser propulsados por combustión interna (litros de combustible fósil), eléctrica (kWh), híbrida enchufable (litros, kWh), o híbrida no enchufable (litros). En caso de coches eléctricos o híbridos enchufables el consumo de electricidad debe cumplimentarse en la pestaña 4_Electricidad.\nEn el caso en que se utilicen otros combustibles diferentes a los indicados en la lista desplegable, ha de seleccionarse la opción \"Otros\" e introducir el factor de emisión correspondiente teniendo en cuenta las unidades en que se expresa (kg CO2/ud). Será necesario indicar en el siguiente cuadro la fuente de donde se extrae dicho factor de emisión así como su valor y unidades:"]
[]
[{"$nulls":3},"Combustible",{"$nulls":4},"Factor de emisión ",null,"Fuente de información"]
[{"$nulls":8},"Valor","Unidades"]
[]
[]
[]
[]
[null,null,"8 Factor de emisión correspondiente al combustible seleccionado que aparece por defecto a excepción de haber seleccionado la opción “Otros” en cuyo caso, habrá que introducir el factor de emisión correspondiente indicando en el cuadro anterior, el nombre del combustible, la fuente de donde se extrae su factor de emisión así como su valor y unidades. Es imprescindible que las unidades respecto a las que se refiere el factor de emisión (kg CO2/ud) sean coincidentes con las unidades en las que se cuantifique la cantidad de combustible consumido."]
[]
[null,null,"9 Si el dato disponible está en unidades monetarias se recomienda realizar la conversión a litros consumidos a partir de los precios que aparecen en el geoportal de hidrocarburos:"]
[null,null,"https://energia.gob.es/es-es/Servicios/Paginas/consultasdecarburantes.aspx"]
[]
[null,null,"10 El factor de emisión (expresado en g CO2/km) se obtiene introduciendo los datos: modelo de coche y tipo de combustible consumido en la aplicación de la web del IDAE \"Consumo de Carburante y Emisiones de CO2 en Coches Nuevos\":\n           http://coches.idae.es/"]
[null,null,"http://coches.idae.es/"]
[]
[null,null,"Hay que tener en cuenta que la \"categoría de coche\" en la web se refiere a las categorías SICE:"]
[null,null,"· M1: Vehículo para transporte de pasajeros y que no contenga más de 8 asientos además del asiento del conductor.\n· M1-AF: M1 con carrocería AF Multiuso; Vehículos de motor con al menos 4 ruedas para el transporte de pasajeros y su equipaje o mercancías en un compartimento, uso comercial.\n· N1: Vehículos utilizados para transporte de carga y con un peso máximo que no exceda las 3,5 tm."]
[]
[]
[]
[null,"3.    OBSERVACIONES: FLUORADOS"]
[]
[null,null,"1 En caso de que los equipos de climatización / refrigeración se ubiquen en diferentes lugares (edificios / sedes) y disponga de los datos desagregados en función de los mismos, si lo desea, puede en esta celda especificar cuáles son y en la hoja 6_Resultados se reflejará el total de emisiones de alcance 1 y alcance 2 asociadas a cada uno de ellos. Tenga en cuenta que si el nombre de una sede aparece varias veces, éste ha de estar escrito exactamente de la misma manera. En caso contrario, el desglose de resultados por sedes será incorrecto.\n"]
[]
[null,null,"2 Para cada equipo, se seleccionará el gas refrigerante que utilice o, en su caso, la \"mezcla\" de gases. El Reglamento (UE) N° 517/2014 del Parlamento Europeo y del Consejo, de 16 de abril de 2014, sobre los gases fluorados de efecto invernadero y por el que se deroga el Reglamento (CE) N° 842/2006, define \"mezcla\" como un fluido compuesto de dos o más sustancias, de las cuales al menos una es una sustancia enumerada en el anexo I o en el anexo II. Entre las opciones disponibles en la lista, además de gases puros se pueden seleccionar las mezclas más comunes que se utilizan en España (en el listado son los refrigerantes denominados R-\"número\"). En el caso de que el equipo emplee un gas puro (fluorado o no fluorado) o una mezcla que no aparezca en el listado, se escogerá la opción \"Otros\". Puede obtener el PCA de los gases puros de los Anexos I, II, y IV del Reglamento (UE) N° 517/2014. Si la mezcla del equipo no está incluida en listado, se calculará su PCA empleando los PCA de sus componentes (indicados en la pestaña 7_Factores de emisión y, en su defecto, en el Reglamento) y en función de la proporción en que aparezcan en la mezcla."]
[]
[]
[]
[null,null,"3 Potenciales de Calentamiento Atmosférico que se indican en el Cuarto Informe de Evaluación del IPCC (Reglamento 517/2014)."]
[null,null,"4 Recarga anual: cantidad de gas refrigerante adicionado (expresado en kg) durante el periodo de cálculo. Estas recargas se producen cuando se ha detectado una fuga, y el dato se registra en las hojas de control de fugas efectuadas por los equipos de mantenimiento certificados."]
[]
[]
[null,"4.    OBSERVACIONES: ELECTRICIDAD"]
[]
[null,null,"1 En caso de que las instalaciones que consumen electricidad se ubiquen en diferentes lugares (edificios / sedes) y disponga de los datos desagregados en función de los mismos, si lo desea, puede en esta celda especificar cuáles son y en la hoja 6_Resultados se reflejará el total de emisiones de alcance 1 y alcance 2 asociadas a cada uno de ellos. Tenga en cuenta que si el nombre de una sede aparece varias veces, éste ha de estar escrito exactamente de la misma manera. En caso contrario, el desglose de resultados por sedes será incorrecto.\n"]
[]
[null,null,"2 El Sistema de Garantía de Origen y etiquetado de la electricidad es un sistema mediante el cual la CNMC (Comisión Nacional de los Mercados y la Competencia) garantiza que el origen de la energía eléctrica generada proviene de fuentes renovables o de sistemas de alta eficiencia. Las GdO a las que se refiere esta calculadora son las que acreditan que la energía eléctrica generada proviene de fuentes renovables.\nEn caso de que su organización, por disponer de varias sedes, almacenes, etc., tenga contratada la electricidad con varias comercializadoras diferentes y, en lugar de desglosar  los consumos que se incluyen en las facturas de cada una de ellas, prefiera hacer la suma total, tendrá que escoger la opción del desplegable \"Varias comercializadoras\" en el campo \"Nombre de la comercializadora suministradora de energía\". Así, se asumirá que ninguna de comercializadoras que usted tiene contratadas disponen de GdO de la electricidad renovable y, su factor de emisión será el correspondiente al valor medio de las empresas comercializadoras sin GdO."]
[]
[null,null,"3 Listado de comercializadoras españolas que han estado activas en el año de estudio y que se engloban dentro del Sistema de Garantía de Origen. \nEs imprescindible que indique previamente el año de cálculo en la pestaña 1_Datos generales organización para que aparezca el listado de las comercializadoras que disponían de GdO durante el mismo y los correspondientes factores de mix eléctrico."]
[null,null,"·  En caso de que la comercializadora que tiene contratada no sea ninguna de las que aparecen en el listado (comercializadoras que no han participado en el sistema de Garantías "]
[null,null,"de Origen), deberá escoger la opción \"Otras\". Se le aplicará en ese caso el mix correspondiente a las comercializadoras sin GdO."]
[null,null,"·  En caso de que su organización tenga contratada la electricidad con varias comercializadoras diferentes y, en lugar de desglosar los kWh consumidos en cada una de ellas, prefiera"]
[null,null,"hacer la suma total, tendrá que escoger la opción del desplegable \"Varias comercializadoras\" en cuyo caso, el factor de emisión que aparecerá será el correspondiente al valor medio de las empresas comercializadoras sin GdO."]
[]
[null,null,"4 Para cada comercializadora, se indicará la suma de los kWh consumidos que se reflejan en las facturas de electricidad comprendidas en el año de estudio. En caso de escoger la opción \"Varias comercializadoras\", deberá indicar la suma de los kWh consumidos durante el año de estudio para todas las comercializadoras."]
[]
[null,null,"5 Factor de emisión que aparece por defecto en función del año y de la comercializadora suministradora de la electricidad (Fuente: Comisión Nacional de los Mercados y la Competencia): "]
[null,null,"https://gdo.cnmc.es/CNE/resumenGdo.do?anio="]
[]
[]
[null,"5.    INFORMACIÓN ADICIONAL - INSTALACIONES PROPIAS DE ENERGÍA RENOVABLE"]
[]
[null,null,"1 En caso de que las instalaciones para la generación de energía renovable (paneles fotovoltaicos, turbinas de viento, calderas de biomasa, etc.) se ubiquen en diferentes lugares (edificios / sedes) y disponga de los datos desagregados en función de los mismos, si lo desea, puede en esta celda especificar cuáles son.\n"]
[]
[null,null,"2 En caso de que las calderas para la generación de energía a partir de biomasa se ubiquen en diferentes lugares (edificios / sedes) y disponga de los datos desagregados en función de los mismos, si lo desea, puede en esta celda especificar cuáles son."]

{"sheet":"9. Consumos. Hoja de trabajo","index":9,"n_rows":24,"n_cols":14,"rows_kept":24,"merged":[[0,0,0,14],[1,0,2,14]]}
["                                                                 CONSUMOS. HOJA DE TRABAJO"]
["En esta hoja de cumplimentación voluntaria puede incluir los cálculos auxiliares necesarios para obtener los datos de consumo anuales. Si lo prefiere puede entregar esta información en un documento aparte. Estos cálculos servirán para facilitar su trabajo de recopilación de datos y el cotejo de los consumos por parte del Registro de huella de carbono, compensación y proyectos de absorción de dióxido de carbono. Podría considerar los siguientes bloques:"]
[]
[]
[null," - Combustibles fósiles de equipos fijos: datos de consumo de combustibles desglosados según facturas y/o lecturas de contadores"]
[null," - Combustibles fósiles de vehículos: datos de consumo de combustibles o de distancia recorrida desglosados según facturas y/o lecturas de contadores."]
[null," - Fugas de fluorados: datos de las hojas de registro de mantenimiento de los equipos de climatización o refrigeración."]
[null," - Electricidad: datos mensuales o bimensuales de las facturas de la comercializadora de electricidad."]
[]
[null,"Adapte esta tabla según sus necesidades"]
[null,null,"Consumo_","Consumo_","Consumo_","Consumo_","Consumo_","Consumo_","Consumo_","Consumo_","Consumo_","Consumo_","Consumo_","Consumo_"]
[null,"Enero"]
[null,"Febrero"]
[null,"Marzo"]
[null,"Abril"]
[null,"Mayo"]
[null,"Junio"]
[null,"Julio"]
[null,"Agosto"]
[null,"Septiembre"]
[null,"Octubre"]
[null,"Noviembre"]
[null,"Diciembre"]
[null,"TOTAL",{"$f":"SUM(C12:C23)","v":{"v":0,"d":"0.0"}},{"$f":"SUM(D12:D23)","v":{"v":0,"d":"0.0"}},{"v":0,"d":"0.0"},{"v":0,"d":"0.0"},{"v":0,"d":"0.0"},{"v":0,"d":"0.0"},{"v":0,"d":"0.0"},{"v":0,"d":"0.0"},{"v":0,"d":"0.0"},{"v":0,"d":"0.0"},{"v":0,"d":"0.0"},{"v":0,"d":"0.0"}]

{"sheet":"10. Revisiones calculadora","index":10,"n_rows":34,"n_cols":4,"rows_kept":34,"merged":[[0,0,0,14],[2,3,2,14],[3,3,3,14],[4,3,4,14],[5,1,8,1],[5,2,8,2],[5,3,8,14],[9,1,16,1],[9,2,16,2],[9,3,16,14],[17,3,17,14],[18,3,18,14],[19,3,19,14],[20,3,20,14],[21,3,21,14],[22,3,22,14],[23,3,23,14],[24,3,24,14],[25,3,25,14],[26,3,26,14],[27,3,27,14],[28,3,28,14],[29,3,29,14],[30,3,30,14],[31,3,31,14],[32,3,32,14],[33,3,33,14]]}
["                                                                  REVISIONES DE LA CALCULADORA DE HUELLA DE CARBONO"]
[]
[null,"Versión","Fecha de publicación en la web","Revisiones"]
[null,"V0","2014-05-30","-"]
[null,"V1","2014-06-02","Pestaña \"Resultados\": corrección de las unidades en las que se expresan las emisiones totales derivadas de las fugas de gases fluorados."]
[null,"V2","2014-06-13","Pestaña \"Resultados\": se modifica el número de decimales en que se expresan los resultados.\nPestaña \"Factores de Emisión\": se sustituyen los valores de los Potenciales de calentamiento global de los preparados más comunes indicados en el Tercer Informe de Evaluación del IPCC, por los que aparecen en el Cuarto Informe de Evaluación del IPCC.\nPestaña \"Revisiones calculadora\": Se añade esta pestaña que anteriormente no existía."]
[]
[]
[]
[null,"V3","2015-04-01","Pestaña \"Datos generales organización\": se solicita un único índice de actividad y, de forma independiente y voluntaria, se solicitan los valores de superficie y nº de empleados de la organización.\nPestaña \"Combustibles fósiles\": se limita a 3 el número de decimales de los factores de emisión y se corrigen las unidades en las que se expresan los resultados.\nPestaña \"Fluorados\": corrección del valor del PCG del preparado R407 C.\nPestaña \"Electricidad\": se incluye la opción \"Otras\" en el listado de las comercializadoras de electricidad y se modifica el orden de las columnas.\nPestaña \"Resultados\": se modifican las unidades en que se expresan los valores relativos.\nPestaña \"Factores de emisión\": se incluyen los factores relativos al año 2014.\nSe ofrece la opción de desglosar la información por sedes en cuyo caso pueden obtenerse los resultados también desglosados.\nPermite calcular la huella de carbono para el año 2014."]
{"$rows_empty":7}
[null,"V4","2015-04-15","Pestaña \"Factores de emisión\": corrección del valor del mix eléctrico en el año 2014 para las comercializadoras: Enérgya VM Gestión de energía, S.L.U. e Iberdrola Clientes, S.A.U.\nUnidades en las que se expresan los resultados (t CO2 - t CO2 eq)"]
[null,"V5","2015-06-22","Pestaña \"Factores de emisión\": actualización de los valores de los factores de emisión y de los PCI a partir del último Inventario de emisiones de gases de efecto invernadero de España. Años 1990-2012."]
[null,"V6","2016-04-04","Pestaña \"Combustibles fósiles\": en el apartado \"Desplazamientos - Opción B1\", corrección de una de las celdas en la que no aparecía el factor de emisión correspondiente al combustible seleccionado.\nPestaña \"Fluorados\": se añade una nota relativa al momento en que se registran las emisiones de gases fluorados.\nPestaña \"Factores de emisión\": actualización de los valores de los factores de emisión y de los PCI a partir del último Inventario de emisiones de gases de efecto invernadero de España. Años 1990-2014. Se añaden los factores de los mix eléctricos según comercializadoras del año 2015."]
[null,"V7","2016-07-29","Pestaña \"Factores de emisión\": corrección de los factores de emisión y de los PCI de 2015 en función de las correcciones publicadas por el Inventario de emisiones de gases de efecto invernadero de España. Años 1990-2014.\nActualizaciones en base a las Directrices del IPCC para los Inventarios nacionales de gases de efecto invernadero de 2006."]
[null,"V8","2016-10-17","Pestaña \"Factores de emisión\": corrección de los factores de emisión del gas natural, el GNC y el GNL."]
[null,"V9","2017-04-21","Pestaña \"Datos generales de la organización\": inclusión de un año más.\nPestaña \"Resultados\": inclusión de un año más para la comparación de la media del ratio de emisiones de dos trienios.\nPestaña \"Factores de emisión\": corrección del PCG del R-417A, incorporación de los factores de emisión para el año 2016 (los factores de los mix eléctricos son provisionales) y actualización de los factores de emisión y los PCI para toda serie la histórica en base a las Directrices del IPCC para los Inventarios nacionales de gases de efecto invernadero de 2006."]
[null,"V10","2017-09-01","Pestaña \"Fluorados\": inclusión de posibilidad de introducir 0,0 kg de refrigerante recargado.\nPestaña \"Factores de emisión\": se dan por definitivos los factores de los mix eléctricos de las comercializadoras que disponen de GdO y que han estado operativas durante el año 2016. "]
[null,"V11","2018-04-11","Pestaña \"Factores de emisión\": se incorporan los factores de emisión para el año 2017 y se añade el gasóleo B como posible combustible de instalaciones fijas. Se corrigen los valores del PCG de los preparados R-407B, R-407F y R-442A."]
[null,"V12","2018-09-06","Pestaña \"Combustibles fósiles\": se corrige error de multiplicación que se producía a partir de la fila 10 en \"Consumo de combustibles en instalaciones fijas\". En \"Consumo de combustibles en desplazamientos\", se añade el combustible B7.\nPestaña \"Fluorados\": se añade el preparado R-449A."]
[null,"V13","2018-12-18","Pestaña \"Combustibles fósiles\" y pestaña \"Electricidad\": se engloba la electricidad consumida por vehículos eléctricos y/o híbridos enchufables en las emisiones indirectas de alcance 2."]
[null,"V14","2019-04-05","Pestaña \"Factores de emisión\": actualización de los valores de los factores de emisión y de los PCI a partir del Inventario de emisiones de gases de efecto invernadero de España. Años 1990-2017 y los factores de los mix eléctricos de las comercializadoras de electricidad publicados por la Comisión Nacional de los Mercados y la Competencia."]
[null,"V15","2019-09-30","Pestaña \"Electricidad\":  las Garantías de Origen de la electricidad (GdO) a las que se refiere esta calculadora son las que acreditan que la energía eléctrica generada proviene de fuentes renovables."]
[null,"V16","2019-12-27","Pestaña \"Fluorados\": corrección de los PCG de los preparados HFC-152a y R-413A."]
[null,"V17","2020-04-23","Pestaña \"Factores de emisión\": actualización de los valores de los factores de emisión y de los PCI a partir del Inventario de emisiones de gases de efecto invernadero de España. Años 1990-2018 y los factores de los mix eléctricos de las comercializadoras de electricidad publicados por la Comisión Nacional de los Mercados y la Competencia.\nPestaña \"Combustibles fósiles\": se actualiza la denominación de los combustibles en base a la nueva normativa europea sobre etiquetado para carburantes y vehículos."]
[null,"V18","2020-06-04","Pestañas \"Combustibles fósiles\" y \"Factores de emisión\": corrección del factor de emisión del gasóleo B para toda la serie histórica en base a la densidad especificada en el Real Decreto 1088/2010 y sin aplicar los objetivos obligatorios mínimos de biocarburantes en cómputo anual considerados en el Real Decreto 1085/2015 que afectarían únicamente al gasóleo A. El factor de emisión del gas natural se expresa en PCS empleando un factor de conversión para el paso de PCS a PCI de 0,901 (Inventario Nacional de Emisiones de España).\nPestaña \"Fluorados\": se añaden los preparados R-452A y R-453A."]
[null,"V19","2020-06-10","Pestaña \"Factores de emisión\": corrección del factor de emisión del gas natural expresado en kCO2/kWhPCS."]
[null,"V20","2020-07-07","Pestaña \"Resultados\": corrección del resultado de emisiones de alcance 2 incluyendo los vehículos eléctricos."]

{"sheet":"Datos","index":11,"n_rows":385,"n_cols":33,"rows_kept":385,"hidden":true}
[]
[{"$nulls":3},"AÑO DE CÁLCULO",null,{"$f":"'1_Datos generales organización'!G3","v":0},{"$nulls":10},"Lista comb instalaciones fijas 2007 - 2018",null,"Lista comb instalaciones fijas 2019",{"$nulls":4},"Lista comb vehículos 2007-2018",{"$nulls":4},"Lista comb vehículos 2019"]
[{"$nulls":16},"Gasóleo C (l)",null,"Gasóleo C (l)",{"$nulls":4},"Gasolina (l)",{"$nulls":4},"E5  (l)"]
["1_Datos generales organización",{"$nulls":15},"Gasóleo B (l)",null,"Gasóleo B (l)",{"$nulls":4},"Gasóleo A (l)",{"$nulls":4},"E10  (l)"]
[{"$nulls":16},"Gas natural (kWh)*",null,"Gas natural (kWh)*",{"$nulls":4},"Gasóleo B (l)",{"$nulls":4},"E85 (l)"]
[null,null,"Lista años","Lista tipo organización","Lista sector",{"$nulls":11},"LNG (kWh)*",null,"LNG (kWh)*",{"$nulls":4},"E5  (l)",{"$nulls":4},"E100 (l)"]
[null,null,2019,"Administración Pública","A.- Agricultura, ganadería, silvicultura y pesca",{"$nulls":11},"CNG (kWh)*",null,"CNG (kWh)*",{"$nulls":4},"E10  (l)",{"$nulls":4},"B7 (l)"]
[null,null,2018,"Mediana empresa","B.- Industrias extractivas",{"$nulls":11},"LPG (l)",null,"LPG (l)",{"$nulls":4},"E85 (l)",{"$nulls":4},"B10 (l)"]
[null,null,2017,"Microempresa","C.- Industria manufacturera",{"$nulls":11},"Gas butano (kg)",null,"Gas butano (kg)",{"$nulls":4},"E100 (l)",{"$nulls":4},"B20 (l)"]
[null,null,2016,"Pequeña empresa","D.- Suministro de energía eléctrica, gas, vapor y aire acondicionado",{"$nulls":11},"Gas propano kg)",null,"Gas propano kg)",{"$nulls":4},"B7 (l)",{"$nulls":4},"B30 (l)"]
[null,null,2015,"Otras","E.- Suministro de agua, actividades de saneamiento, gestión de residuos y descontaminación",{"$nulls":11},"Fuelóleo (kg)",null,"Fuelóleo (kg)",{"$nulls":4},"B10 (l)",{"$nulls":4},"B100 (l)"]
[null,null,2014,null,"F.- Construcción",{"$nulls":11},"Carbón nacional (kg)",null,"Carbón nacional (kg)",{"$nulls":4},"B20 (l)",{"$nulls":4},"Gasóleo B (l)"]
[null,null,2013,null,"G.- Comercio al por mayor y al por menor; reparación de vehículos de motor y motocicletas",{"$nulls":11},"Carbón de importación (kg)",null,"Carbón de importación (kg)",{"$nulls":4},"B30 (l)",{"$nulls":4},"XTL (l)"]
[null,null,2012,null,"H.- Transporte y almacenamiento",{"$nulls":11},"Coque de petróleo (kg)",null,"Coque de petróleo (kg)",{"$nulls":4},"B100 (l)",{"$nulls":4},"LNG (kWh)*"]
[null,null,2011,null,"I.- Hostelería",{"$nulls":11},"Gasolina (l)",null,"E5  (l)",{"$nulls":4},"XTL (l)",{"$nulls":4},"CNG (kWh)*"]
[null,null,2010,null,"J.- Información y comunicaciones",{"$nulls":11},"Gasóleo A (l)",null,"E10  (l)",{"$nulls":4},"LNG (kWh)*",{"$nulls":4},"LPG (l)"]
[{"$nulls":4},"K.- Actividades financieras y de seguros",{"$nulls":11},"E5  (l)",null,"E85 (l)",{"$nulls":4},"CNG (kWh)*",{"$nulls":4},"H2 (kg)"]
[{"$nulls":4},"L.- Actividades inmobiliarias",{"$nulls":11},"E10  (l)",null,"E100 (l)",{"$nulls":4},"LPG (l)",{"$nulls":4},"Fuelóleo (kg)"]
[{"$nulls":4},"M.- Actividades profesionales, científicas y técnicas",{"$nulls":11},"E85 (l)",null,"B7 (l)",{"$nulls":4},"H2 (kg)"]
[{"$nulls":4},"N.- Actividades administrativas y servicios auxiliares",{"$nulls":11},"E100 (l)",null,"B10 (l)",{"$nulls":4},"Fuelóleo (kg)"]
[{"$nulls":4},"O.- Administración pública y defensa; seguridad social obligatoria",{"$nulls":11},"B7 (l)",null,"B20 (l)",{"$nulls":9},"Excluyo respecto a años anteriores:"]
[{"$nulls":4},"P.- Educación",{"$nulls":11},"B10 (l)",null,"B30 (l)",{"$nulls":9},"Gasolina (l)"]
[{"$nulls":4},"Q.- Actividades sanitarias y de servicios sociales",{"$nulls":11},"B20 (l)",null,"B100 (l)",{"$nulls":4},"Excluyo respecto a fijas:",{"$nulls":4},"Gasóleo A (l)"]
[{"$nulls":4},"R.- Actividades artísticas, recreativas y de entretenimiento",{"$nulls":11},"B30 (l)",{"$nulls":6},"Gas natural (kWh)*"]
[{"$nulls":4},"S.- Otros servicios",{"$nulls":11},"B100 (l)",{"$nulls":6},"Gasóleo C (l)"]
[{"$nulls":4},"T.- Actividades de los hogares como empleadores de personal doméstico; actividades de los hogares como productores de bienes y servicios para uso propio",{"$nulls":13},"Excluyo respecto a años anteriores:",{"$nulls":4},"Gas butano (kg)"]
[{"$nulls":4},"U.- Actividades de organizaciones y organismos extraterritoriales",{"$nulls":13},"Gasolina (l)",{"$nulls":4},"Gas propano kg)"]
[{"$nulls":16},"Excluyo respecto a vehículos:",null,"Gasóleo A (l)",{"$nulls":4},"Carbón nacional (kg)"]
[null,null,2010,2011,2012,2013,2014,2015,2016,2017,2018,2019,{"$nulls":4},"XTL (l)",{"$nulls":6},"Carbón de importación (kg)"]
[null,null,"Lista_Comb_fósiles_fijos_2010","Lista_Comb_fósiles_fijos_2011","Lista_Comb_fósiles_fijos_2012","Lista_Comb_fósiles_fijos_2013","Lista_Comb_fósiles_fijos_2014","Lista_Comb_fósiles_fijos_2015","Lista_Comb_fósiles_fijos_2016","Lista_Comb_fósiles_fijos_2017","Lista_Comb_fósiles_fijos_2018","Lista_Comb_fósiles_fijos_2019",{"$nulls":4},"H2 (kg)",{"$nulls":6},"Coque de petróleo (kg)"]
[null,null,"Biomasa (kg)","Biomasa (kg)","Biomasa (kg)","Biomasa (kg)","Biomasa (kg)","Biomasa (kg)","Biomasa (kg)","Biomasa (kg)","Biomasa (kg)","Biomasa (kg)"]
[null,null,"Gasóleo C (l)","Gasóleo C (l)","Gasóleo C (l)","Gasóleo C (l)","Gasóleo C (l)","Gasóleo C (l)","Gasóleo C (l)","Gasóleo C (l)","Gasóleo C (l)","Gasóleo C (l)",{"$nulls":11},"Añado respecto a fijas:"]
[null,null,"Gasóleo B (l)","Gasóleo B (l)","Gasóleo B (l)","Gasóleo B (l)","Gasóleo B (l)","Gasóleo B (l)","Gasóleo B (l)","Gasóleo B (l)","Gasóleo B (l)","Gasóleo B (l)",{"$nulls":11},"XTL (l)"]
[null,null,"Gas natural (kWh)*","Gas natural (kWh)*","Gas natural (kWh)*","Gas natural (kWh)*","Gas natural (kWh)*","Gas natural (kWh)*","Gas natural (kWh)*","Gas natural (kWh)*","Gas natural (kWh)*","Gas natural (kWh)*",{"$nulls":11},"H2 (kg)"]
[null,null,"LNG (kWh)*","LNG (kWh)*","LNG (kWh)*","LNG (kWh)*","LNG (kWh)*","LNG (kWh)*","LNG (kWh)*","LNG (kWh)*","LNG (kWh)*","LNG (kWh)*"]
[null,null,"CNG (kWh)*","CNG (kWh)*","CNG (kWh)*","CNG (kWh)*","CNG (kWh)*","CNG (kWh)*","CNG (kWh)*","CNG (kWh)*","CNG (kWh)*","CNG (kWh)*"]
[null,null,"LPG (l)","LPG (l)","LPG (l)","LPG (l)","LPG (l)","LPG (l)","LPG (l)","LPG (l)","LPG (l)","LPG (l)"]
[null,null,"Gas butano (kg)","Gas butano (kg)","Gas butano (kg)","Gas butano (kg)","Gas butano (kg)","Gas butano (kg)","Gas butano (kg)","Gas butano (kg)","Gas butano (kg)","Gas butano (kg)"]
[null,null,"Gas propano kg)","Gas propano kg)","Gas propano kg)","Gas propano kg)","Gas propano kg)","Gas propano kg)","Gas propano kg)","Gas propano kg)","Gas propano kg)","Gas propano kg)"]
[null,null,"Fuelóleo (kg)","Fuelóleo (kg)","Fuelóleo (kg)","Fuelóleo (kg)","Fuelóleo (kg)","Fuelóleo (kg)","Fuelóleo (kg)","Fuelóleo (kg)","Fuelóleo (kg)","Fuelóleo (kg)"]
[null,null,"Carbón nacional (kg)","Carbón nacional (kg)","Carbón nacional (kg)","Carbón nacional (kg)","Carbón nacional (kg)","Carbón nacional (kg)","Carbón nacional (kg)","Carbón nacional (kg)","Carbón nacional (kg)","Carbón nacional (kg)"]
[null,null,"Carbón de importación (kg)","Carbón de importación (kg)","Carbón de importación (kg)","Carbón de importación (kg)","Carbón de importación (kg)","Carbón de importación (kg)","Carbón de importación (kg)","Carbón de importación (kg)","Carbón de importación (kg)","Carbón de importación (kg)"]
[null,null,"Coque de petróleo (kg)","Coque de petróleo (kg)","Coque de petróleo (kg)","Coque de petróleo (kg)","Coque de petróleo (kg)","Coque de petróleo (kg)","Coque de petróleo (kg)","Coque de petróleo (kg)","Coque de petróleo (kg)","Coque de petróleo (kg)"]
[null,null,"Gasolina (l)","Gasolina (l)","Gasolina (l)","Gasolina (l)","Gasolina (l)","Gasolina (l)","Gasolina (l)","Gasolina (l)","Gasolina (l)","E5 (l)"]
[null,null,"Gasóleo A (l)","Gasóleo A (l)","Gasóleo A (l)","Gasóleo A (l)","Gasóleo A (l)","Gasóleo A (l)","Gasóleo A (l)","Gasóleo A (l)","Gasóleo A (l)","E10 (l)"]
[null,null,"E5 (l)","E5 (l)","E5 (l)","E5 (l)","E5 (l)","E5 (l)","E5 (l)","E5 (l)","E5 (l)","E85 (l)"]
[null,null,"E10 (l)","E10 (l)","E10 (l)","E10 (l)","E10 (l)","E10 (l)","E10 (l)","E10 (l)","E10 (l)","E100 (l)"]
[null,null,"E85 (l)","E85 (l)","E85 (l)","E85 (l)","E85 (l)","E85 (l)","E85 (l)","E85 (l)","E85 (l)","B7 (l)"]
[null,null,"E100 (l)","E100 (l)","E100 (l)","E100 (l)","E100 (l)","E100 (l)","E100 (l)","E100 (l)","E100 (l)","B10 (l)"]
[null,null,"B7 (l)","B7 (l)","B7 (l)","B7 (l)","B7 (l)","B7 (l)","B7 (l)","B7 (l)","B7 (l)","B20 (l)"]
[null,null,"B10 (l)","B10 (l)","B10 (l)","B10 (l)","B10 (l)","B10 (l)","B10 (l)","B10 (l)","B10 (l)","B30 (l)"]
[null,null,"B20 (l)","B20 (l)","B20 (l)","B20 (l)","B20 (l)","B20 (l)","B20 (l)","B20 (l)","B20 (l)","B100 (l)"]
[null,null,"B30 (l)","B30 (l)","B30 (l)","B30 (l)","B30 (l)","B30 (l)","B30 (l)","B30 (l)","B30 (l)","Otros (ud)"]
[null,null,"B100 (l)","B100 (l)","B100 (l)","B100 (l)","B100 (l)","B100 (l)","B100 (l)","B100 (l)","B100 (l)"]
[null,null,"Otros (ud)","Otros (ud)","Otros (ud)","Otros (ud)","Otros (ud)","Otros (ud)","Otros (ud)","Otros (ud)","Otros (ud)"]
[]
[]
[]
[null,null,2010,2011,2012,2013,2014,2015,2016,2017,2018,2019]
[null,null,"Lista_Comb_fósiles_vehículos_2010","Lista_Comb_fósiles_vehículos_2011","Lista_Comb_fósiles_vehículos_2012","Lista_Comb_fósiles_vehículos_2013","Lista_Comb_fósiles_vehículos_2014","Lista_Comb_fósiles_vehículos_2015","Lista_Comb_fósiles_vehículos_2016","Lista_Comb_fósiles_vehículos_2017","Lista_Comb_fósiles_vehículos_2018","Lista_Comb_fósiles_vehículos_2019"]
[null,null,"Gasolina (l)","Gasolina (l)","Gasolina (l)","Gasolina (l)","Gasolina (l)","Gasolina (l)","Gasolina (l)","Gasolina (l)","Gasolina (l)","E5 (l)"]
[null,null,"Gasóleo A (l)","Gasóleo A (l)","Gasóleo A (l)","Gasóleo A (l)","Gasóleo A (l)","Gasóleo A (l)","Gasóleo A (l)","Gasóleo A (l)","Gasóleo A (l)","E10 (l)"]
[null,null,"Gasóleo B (l)","Gasóleo B (l)","Gasóleo B (l)","Gasóleo B (l)","Gasóleo B (l)","Gasóleo B (l)","Gasóleo B (l)","Gasóleo B (l)","Gasóleo B (l)","E85 (l)"]
[null,null,"E5 (l)","E5 (l)","E5 (l)","E5 (l)","E5 (l)","E5 (l)","E5 (l)","E5 (l)","E5 (l)","E100 (l)"]
[null,null,"E10 (l)","E10 (l)","E10 (l)","E10 (l)","E10 (l)","E10 (l)","E10 (l)","E10 (l)","E10 (l)","B7 (l)"]
[null,null,"E85 (l)","E85 (l)","E85 (l)","E85 (l)","E85 (l)","E85 (l)","E85 (l)","E85 (l)","E85 (l)","B10 (l)"]
[null,null,"E100 (l)","E100 (l)","E100 (l)","E100 (l)","E100 (l)","E100 (l)","E100 (l)","E100 (l)","E100 (l)","B20 (l)"]
[null,null,"B7 (l)","B7 (l)","B7 (l)","B7 (l)","B7 (l)","B7 (l)","B7 (l)","B7 (l)","B7 (l)","B30 (l)"]
[null,null,"B10 (l)","B10 (l)","B10 (l)","B10 (l)","B10 (l)","B10 (l)","B10 (l)","B10 (l)","B10 (l)","B100 (l)"]
[null,null,"B20 (l)","B20 (l)","B20 (l)","B20 (l)","B20 (l)","B20 (l)","B20 (l)","B20 (l)","B20 (l)","Gasóleo B (l)"]
[null,null,"B30 (l)","B30 (l)","B30 (l)","B30 (l)","B30 (l)","B30 (l)","B30 (l)","B30 (l)","B30 (l)","XTL (l)"]
[null,null,"B100 (l)","B100 (l)","B100 (l)","B100 (l)","B100 (l)","B100 (l)","B100 (l)","B100 (l)","B100 (l)","LNG (kWh)*"]
[null,null,"XTL (l)","XTL (l)","XTL (l)","XTL (l)","XTL (l)","XTL (l)","XTL (l)","XTL (l)","XTL (l)","CNG (kWh)*"]
[null,null,"LNG (kWh)*","LNG (kWh)*","LNG (kWh)*","LNG (kWh)*","LNG (kWh)*","LNG (kWh)*","LNG (kWh)*","LNG (kWh)*","LNG (kWh)*","LPG (l)"]
[null,null,"CNG (kWh)*","CNG (kWh)*","CNG (kWh)*","CNG (kWh)*","CNG (kWh)*","CNG (kWh)*","CNG (kWh)*","CNG (kWh)*","CNG (kWh)*","H2 (kg)"]
[null,null,"LPG (l)","LPG (l)","LPG (l)","LPG (l)","LPG (l)","LPG (l)","LPG (l)","LPG (l)","LPG (l)","Fuelóleo (kg)"]
[null,null,"H2 (kg)","H2 (kg)","H2 (kg)","H2 (kg)","H2 (kg)","H2 (kg)","H2 (kg)","H2 (kg)","H2 (kg)","Otros (ud)"]
[null,null,"Fuelóleo (kg)","Fuelóleo (kg)","Fuelóleo (kg)","Fuelóleo (kg)","Fuelóleo (kg)","Fuelóleo (kg)","Fuelóleo (kg)","Fuelóleo (kg)","Fuelóleo (kg)"]
[null,null,"Otros (ud)","Otros (ud)","Otros (ud)","Otros (ud)","Otros (ud)","Otros (ud)","Otros (ud)","Otros (ud)","Otros (ud)"]
[]
[]
[]
["2_Combustibles fósiles"]
[]
[null,"Instalaciones fijas",null,1,2,3,4,5,6,7,8,9,10,11]
[null,null,"Combustible escogido","Lista_Comb_fósiles_fijos","Multiplicador\n2010","Multiplicador\n2011","Multiplicador\n2012","Multiplicador\n2013","Multiplicador\n2014","Multiplicador\n2015","Multiplicador\n2016","Multiplicador\n2017","Multiplicador\n2018","Multiplicador\n2019",null,null,"Fórmula FE","Fórmula",null,"Resultado Ins fijas"]
[null,null,{"$f":"'2_Combustibles fósiles'!F18","v":{"v":0,"d":"0.000"}},"Biomasa (kg)",{"v":0,"d":"0.000"},{"v":0,"d":"0.000"},{"v":0,"d":"0.000"},{"v":0,"d":"0.000"},{"v":0,"d":"0.000"},{"v":0,"d":"0.000"},{"v":0,"d":"0.000"},{"v":0,"d":"0.000"},{"v":0,"d":"0.000"},{"v":0,"d":"0.000"},null,null,{"$f":"VLOOKUP(C87,$D$87:$N$111,$F$2-2008,0)","v":{"$error":"#N/A"}},{"$f":"IF(ISNUMBER('2_Combustibles fósiles'!I18),'2_Combustibles fósiles'!G18*'2_Combustibles fósiles'!I18,IF(ISNUMBER('2_Combustibles fósiles'!H18),'2_Combustibles fósiles'!H18*'2_Combustibles fósiles'!G18,\"\"))","v":""},null,{"$f":"SUM(R87:R108)","v":{"v":0,"d":"0.00"}}]
[null,null,{"$f":"'2_Combustibles fósiles'!F19","v":{"v":0,"d":"0.000"}},"Gasóleo C (l)",{"$f":"'7_Factores de emisión'!G12","v":2.868},{"$f":"'7_Factores de emisión'!H12","v":2.868},{"$f":"'7_Factores de emisión'!I12","v":2.868},{"$f":"'7_Factores de emisión'!J12","v":2.868},{"$f":"'7_Factores de emisión'!K12","v":2.868},{"$f":"'7_Factores de emisión'!L12","v":2.868},{"$f":"'7_Factores de emisión'!M12","v":2.868},{"$f":"'7_Factores de emisión'!N12","v":2.868},{"$f":"'7_Factores de emisión'!O12","v":2.868},{"$f":"'7_Factores de emisión'!P12","v":2.868},null,null,{"$f":"VLOOKUP(C88,$D$87:$N$111,$F$2-2008,0)","v":{"$error":"#N/A"}},{"$f":"IF(ISNUMBER('2_Combustibles fósiles'!I19),'2_Combustibles fósiles'!G19*'2_Combustibles fósiles'!I19,IF(ISNUMBER('2_Combustibles fósiles'!H19),'2_Combustibles fósiles'!H19*'2_Combustibles fósiles'!G19,\"\"))","v":""}]
[null,null,{"$f":"'2_Combustibles fósiles'!F20","v":{"v":0,"d":"0.000"}},"Gasóleo B (l)",{"$f":"'7_Factores de emisión'!G11","v":2.708},{"$f":"'7_Factores de emisión'!H11","v":2.708},{"$f":"'7_Factores de emisión'!I11","v":2.708},{"$f":"'7_Factores de emisión'!J11","v":2.708},{"$f":"'7_Factores de emisión'!K11","v":2.708},{"$f":"'7_Factores de emisión'!L11","v":2.708},{"$f":"'7_Factores de emisión'!M11","v":2.708},{"$f":"'7_Factores de emisión'!N11","v":2.708},{"$f":"'7_Factores de emisión'!O11","v":2.708},{"$f":"'7_Factores de emisión'!P11","v":2.708},null,null,{"$error":"#N/A"},{"$f":"IF(ISNUMBER('2_Combustibles fósiles'!I20),'2_Combustibles fósiles'!G20*'2_Combustibles fósiles'!I20,IF(ISNUMBER('2_Combustibles fósiles'!H20),'2_Combustibles fósiles'!H20*'2_Combustibles fósiles'!G20,\"\"))","v":""}]
[null,null,{"$f":"'2_Combustibles fósiles'!F21","v":{"v":0,"d":"0.000"}},"Gas natural (kWh)*",{"$f":"'7_Factores de emisión'!G23","v":0.182},{"$f":"'7_Factores de emisión'!H23","v":0.182},{"$f":"'7_Factores de emisión'!I23","v":0.182},{"$f":"'7_Factores de emisión'!J23","v":0.182},{"$f":"'7_Factores de emisión'!K23","v":0.182},{"$f":"'7_Factores de emisión'!L23","v":0.182},{"$f":"'7_Factores de emisión'!M23","v":0.182},{"$f":"'7_Factores de emisión'!N23","v":0.183},{"$f":"'7_Factores de emisión'!O23","v":0.183},{"$f":"'7_Factores de emisión'!P23","v":0.182},null,null,{"$error":"#N/A"},{"$f":"IF(ISNUMBER('2_Combustibles fósiles'!I21),'2_Combustibles fósiles'!G21*'2_Combustibles fósiles'!I21,IF(ISNUMBER('2_Combustibles fósiles'!H21),'2_Combustibles fósiles'!H21*'2_Combustibles fósiles'!G21,\"\"))","v":""}]
[null,null,{"$f":"'2_Combustibles fósiles'!F22","v":{"v":0,"d":"0.000"}},"LNG (kWh)*",{"$f":"'7_Factores de emisión'!G24","v":0.182},{"$f":"'7_Factores de emisión'!H24","v":0.182},{"$f":"'7_Factores de emisión'!I24","v":0.182},{"$f":"'7_Factores de emisión'!J24","v":0.182},{"$f":"'7_Factores de emisión'!K24","v":0.182},{"$f":"'7_Factores de emisión'!L24","v":0.182},{"$f":"'7_Factores de emisión'!M24","v":0.182},{"$f":"'7_Factores de emisión'!N24","v":0.183},{"$f":"'7_Factores de emisión'!O24","v":0.183},{"$f":"'7_Factores de emisión'!P24","v":0.182},null,null,{"$error":"#N/A"},{"$f":"IF(ISNUMBER('2_Combustibles fósiles'!I22),'2_Combustibles fósiles'!G22*'2_Combustibles fósiles'!I22,IF(ISNUMBER('2_Combustibles fósiles'!H22),'2_Combustibles fósiles'!H22*'2_Combustibles fósiles'!G22,\"\"))","v":""}]
[null,null,{"$f":"'2_Combustibles fósiles'!F23","v":{"v":0,"d":"0.000"}},"CNG (kWh)*",{"$f":"'7_Factores de emisión'!G25","v":0.182},{"$f":"'7_Factores de emisión'!H25","v":0.182},{"$f":"'7_Factores de emisión'!I25","v":0.182},{"$f":"'7_Factores de emisión'!J25","v":0.182},{"$f":"'7_Factores de emisión'!K25","v":0.182},{"$f":"'7_Factores de emisión'!L25","v":0.182},{"$f":"'7_Factores de emisión'!M25","v":0.182},{"$f":"'7_Factores de emisión'!N25","v":0.183},{"$f":"'7_Factores de emisión'!O25","v":0.183},{"$f":"'7_Factores de emisión'!P25","v":0.182},null,null,{"$error":"#N/A"},{"$f":"IF(ISNUMBER('2_Combustibles fósiles'!I23),'2_Combustibles fósiles'!G23*'2_Combustibles fósiles'!I23,IF(ISNUMBER('2_Combustibles fósiles'!H23),'2_Combustibles fósiles'!H23*'2_Combustibles fósiles'!G23,\"\"))","v":""}]
[null,null,{"$f":"'2_Combustibles fósiles'!F24","v":{"v":0,"d":"0.000"}},"LPG (l)",{"$f":"'7_Factores de emisión'!G26","v":1.671},{"$f":"'7_Factores de emisión'!H26","v":1.671},{"$f":"'7_Factores de emisión'!I26","v":1.671},{"$f":"'7_Factores de emisión'!J26","v":1.671},{"$f":"'7_Factores de emisión'!K26","v":1.671},{"$f":"'7_Factores de emisión'!L26","v":1.671},{"$f":"'7_Factores de emisión'!M26","v":1.671},{"$f":"'7_Factores de emisión'!N26","v":1.671},{"$f":"'7_Factores de emisión'!O26","v":1.671},{"$f":"'7_Factores de emisión'!P26","v":1.671},null,null,{"$error":"#N/A"},{"$f":"IF(ISNUMBER('2_Combustibles fósiles'!I24),'2_Combustibles fósiles'!G24*'2_Combustibles fósiles'!I24,IF(ISNUMBER('2_Combustibles fósiles'!H24),'2_Combustibles fósiles'!H24*'2_Combustibles fósiles'!G24,\"\"))","v":""}]
[null,null,{"$f":"'2_Combustibles fósiles'!F25","v":{"v":0,"d":"0.000"}},"Gas butano (kg)",{"$f":"'7_Factores de emisión'!G28","v":2.964},{"$f":"'7_Factores de emisión'!H28","v":2.964},{"$f":"'7_Factores de emisión'!I28","v":2.964},{"$f":"'7_Factores de emisión'!J28","v":2.964},{"$f":"'7_Factores de emisión'!K28","v":2.964},{"$f":"'7_Factores de emisión'!L28","v":2.964},{"$f":"'7_Factores de emisión'!M28","v":2.964},{"$f":"'7_Factores de emisión'!N28","v":2.964},{"$f":"'7_Factores de emisión'!O28","v":2.964},{"$f":"'7_Factores de emisión'!P28","v":2.964},null,null,{"$error":"#N/A"},{"$f":"IF(ISNUMBER('2_Combustibles fósiles'!I25),'2_Combustibles fósiles'!G25*'2_Combustibles fósiles'!I25,IF(ISNUMBER('2_Combustibles fósiles'!H25),'2_Combustibles fósiles'!H25*'2_Combustibles fósiles'!G25,\"\"))","v":""}]
[null,null,{"$f":"'2_Combustibles fósiles'!F26","v":{"v":0,"d":"0.000"}},"Gas propano kg)",{"$f":"'7_Factores de emisión'!G29","v":2.938},{"$f":"'7_Factores de emisión'!H29","v":2.938},{"$f":"'7_Factores de emisión'!I29","v":2.938},{"$f":"'7_Factores de emisión'!J29","v":2.938},{"$f":"'7_Factores de emisión'!K29","v":2.938},{"$f":"'7_Factores de emisión'!L29","v":2.938},{"$f":"'7_Factores de emisión'!M29","v":2.938},{"$f":"'7_Factores de emisión'!N29","v":2.938},{"$f":"'7_Factores de emisión'!O29","v":2.938},{"$f":"'7_Factores de emisión'!P29","v":2.938},null,null,{"$error":"#N/A"},{"$f":"IF(ISNUMBER('2_Combustibles fósiles'!I26),'2_Combustibles fósiles'!G26*'2_Combustibles fósiles'!I26,IF(ISNUMBER('2_Combustibles fósiles'!H26),'2_Combustibles fósiles'!H26*'2_Combustibles fósiles'!G26,\"\"))","v":""}]
[null,null,{"$f":"'2_Combustibles fósiles'!F27","v":{"v":0,"d":"0.000"}},"Fuelóleo (kg)",{"$f":"'7_Factores de emisión'!G30","v":3.127},{"$f":"'7_Factores de emisión'!H30","v":3.127},{"$f":"'7_Factores de emisión'!I30","v":3.127},{"$f":"'7_Factores de emisión'!J30","v":3.127},{"$f":"'7_Factores de emisión'!K30","v":3.127},{"$f":"'7_Factores de emisión'!L30","v":3.127},{"$f":"'7_Factores de emisión'!M30","v":3.127},{"$f":"'7_Factores de emisión'!N30","v":3.127},{"$f":"'7_Factores de emisión'!O30","v":3.127},{"$f":"'7_Factores de emisión'!P30","v":3.127},null,null,{"$error":"#N/A"},{"$f":"IF(ISNUMBER('2_Combustibles fósiles'!I27),'2_Combustibles fósiles'!G27*'2_Combustibles fósiles'!I27,IF(ISNUMBER('2_Combustibles fósiles'!H27),'2_Combustibles fósiles'!H27*'2_Combustibles fósiles'!G27,\"\"))","v":""}]
[null,null,{"$f":"'2_Combustibles fósiles'!F28","v":{"v":0,"d":"0.000"}},"Carbón nacional (kg)",{"$f":"'7_Factores de emisión'!G31","v":2.299},{"$f":"'7_Factores de emisión'!H31","v":2.299},{"$f":"'7_Factores de emisión'!I31","v":2.299},{"$f":"'7_Factores de emisión'!J31","v":2.299},{"$f":"'7_Factores de emisión'!K31","v":2.299},{"$f":"'7_Factores de emisión'!L31","v":2.299},{"$f":"'7_Factores de emisión'!M31","v":2.006},{"$f":"'7_Factores de emisión'!N31","v":2.227},{"$f":"'7_Factores de emisión'!O31","v":2.227},{"$f":"'7_Factores de emisión'!P31","v":1.914},null,null,{"$error":"#N/A"},{"$f":"IF(ISNUMBER('2_Combustibles fósiles'!I28),'2_Combustibles fósiles'!G28*'2_Combustibles fósiles'!I28,IF(ISNUMBER('2_Combustibles fósiles'!H28),'2_Combustibles fósiles'!H28*'2_Combustibles fósiles'!G28,\"\"))","v":""}]
[null,null,{"$f":"'2_Combustibles fósiles'!F29","v":{"v":0,"d":"0.000"}},"Carbón de importación (kg)",{"$f":"'7_Factores de emisión'!G32","v":2.579},{"$f":"'7_Factores de emisión'!H32","v":2.579},{"$f":"'7_Factores de emisión'!I32","v":2.579},{"$f":"'7_Factores de emisión'!J32","v":2.579},{"$f":"'7_Factores de emisión'!K32","v":2.579},{"$f":"'7_Factores de emisión'!L32","v":2.579},{"$f":"'7_Factores de emisión'!M32","v":{"v":2.43,"d":"2.430"}},{"$f":"'7_Factores de emisión'!N32","v":2.444},{"$f":"'7_Factores de emisión'!O32","v":2.444},{"$f":"'7_Factores de emisión'!P32","v":2.429},null,null,{"$error":"#N/A"},{"$f":"IF(ISNUMBER('2_Combustibles fósiles'!I29),'2_Combustibles fósiles'!G29*'2_Combustibles fósiles'!I29,IF(ISNUMBER('2_Combustibles fósiles'!H29),'2_Combustibles fósiles'!H29*'2_Combustibles fósiles'!G29,\"\"))","v":""}]
[null,null,{"$f":"'2_Combustibles fósiles'!F30","v":{"v":0,"d":"0.000"}},"Coque de petróleo (kg)",{"$f":"'7_Factores de emisión'!G23","v":0.182},{"$f":"'7_Factores de emisión'!H23","v":0.182},{"$f":"'7_Factores de emisión'!I23","v":0.182},{"$f":"'7_Factores de emisión'!J23","v":0.182},{"$f":"'7_Factores de emisión'!K23","v":0.182},{"$f":"'7_Factores de emisión'!L23","v":0.182},{"$f":"'7_Factores de emisión'!M23","v":0.182},{"$f":"'7_Factores de emisión'!N23","v":0.183},{"$f":"'7_Factores de emisión'!O23","v":0.183},{"$f":"'7_Factores de emisión'!P23","v":0.182},null,null,{"$error":"#N/A"},{"$f":"IF(ISNUMBER('2_Combustibles fósiles'!I30),'2_Combustibles fósiles'!G30*'2_Combustibles fósiles'!I30,IF(ISNUMBER('2_Combustibles fósiles'!H30),'2_Combustibles fósiles'!H30*'2_Combustibles fósiles'!G30,\"\"))","v":""}]
[null,null,{"$f":"'2_Combustibles fósiles'!F31","v":{"v":0,"d":"0.000"}},"Gasolina (l)",{"$f":"'7_Factores de emisión'!G9","v":2.295},{"$f":"'7_Factores de emisión'!H9","v":2.205},{"$f":"'7_Factores de emisión'!I9","v":2.201},{"$f":"'7_Factores de emisión'!J9","v":2.205},{"$f":"'7_Factores de emisión'!K9","v":2.205},{"$f":"'7_Factores de emisión'!L9","v":2.205},{"$f":"'7_Factores de emisión'!M9","v":2.196},{"$f":"'7_Factores de emisión'!N9","v":{"v":2.18,"d":"2.180"}},{"$f":"'7_Factores de emisión'!O9","v":2.157},{"$f":"'7_Factores de emisión'!P9","v":"-"},null,null,{"$error":"#N/A"},{"$f":"IF(ISNUMBER('2_Combustibles fósiles'!I31),'2_Combustibles fósiles'!G31*'2_Combustibles fósiles'!I31,IF(ISNUMBER('2_Combustibles fósiles'!H31),'2_Combustibles fósiles'!H31*'2_Combustibles fósiles'!G31,\"\"))","v":""}]
[null,null,{"$f":"'2_Combustibles fósiles'!F32","v":{"v":0,"d":"0.000"}},"Gasóleo A (l)",{"$f":"'7_Factores de emisión'!G10","v":2.653},{"$f":"'7_Factores de emisión'!H10","v":2.493},{"$f":"'7_Factores de emisión'!I10","v":2.467},{"$f":"'7_Factores de emisión'!J10","v":2.544},{"$f":"'7_Factores de emisión'!K10","v":2.544},{"$f":"'7_Factores de emisión'!L10","v":2.544},{"$f":"'7_Factores de emisión'!M10","v":2.539},{"$f":"'7_Factores de emisión'!N10","v":{"v":2.52,"d":"2.520"}},{"$f":"'7_Factores de emisión'!O10","v":2.493},{"$f":"'7_Factores de emisión'!P10","v":"-"},null,null,{"$error":"#N/A"},{"$f":"IF(ISNUMBER('2_Combustibles fósiles'!I32),'2_Combustibles fósiles'!G32*'2_Combustibles fósiles'!I32,IF(ISNUMBER('2_Combustibles fósiles'!H32),'2_Combustibles fósiles'!H32*'2_Combustibles fósiles'!G32,\"\"))","v":""}]
[null,null,{"$f":"'2_Combustibles fósiles'!F33","v":{"v":0,"d":"0.000"}},"E5 (l)",{"$f":"'7_Factores de emisión'!G13","v":{"v":2.18,"d":"2.180"}},{"$f":"'7_Factores de emisión'!H13","v":{"v":2.18,"d":"2.180"}},{"$f":"'7_Factores de emisión'!I13","v":{"v":2.18,"d":"2.180"}},{"$f":"'7_Factores de emisión'!J13","v":{"v":2.18,"d":"2.180"}},{"$f":"'7_Factores de emisión'!K13","v":{"v":2.18,"d":"2.180"}},{"$f":"'7_Factores de emisión'!L13","v":{"v":2.18,"d":"2.180"}},{"$f":"'7_Factores de emisión'!M13","v":{"v":2.18,"d":"2.180"}},{"$f":"'7_Factores de emisión'!N13","v":{"v":2.18,"d":"2.180"}},{"$f":"'7_Factores de emisión'!O13","v":{"v":2.18,"d":"2.180"}},{"$f":"'7_Factores de emisión'!P13","v":{"v":2.18,"d":"2.180"}},null,null,{"$error":"#N/A"},{"$f":"IF(ISNUMBER('2_Combustibles fósiles'!I33),'2_Combustibles fósiles'!G33*'2_Combustibles fósiles'!I33,IF(ISNUMBER('2_Combustibles fósiles'!H33),'2_Combustibles fósiles'!H33*'2_Combustibles fósiles'!G33,\"\"))","v":""}]
[null,null,{"$f":"'2_Combustibles fósiles'!F34","v":{"v":0,"d":"0.000"}},"E10 (l)",{"$f":"'7_Factores de emisión'!G14","v":2.065},{"$f":"'7_Factores de emisión'!H14","v":2.065},{"$f":"'7_Factores de emisión'!I14","v":2.065},{"$f":"'7_Factores de emisión'!J14","v":2.065},{"$f":"'7_Factores de emisión'!K14","v":2.065},{"$f":"'7_Factores de emisión'!L14","v":2.065},{"$f":"'7_Factores de emisión'!M14","v":2.065},{"$f":"'7_Factores de emisión'!N14","v":2.065},{"$f":"'7_Factores de emisión'!O14","v":2.065},{"$f":"'7_Factores de emisión'!P14","v":2.065},null,null,{"$error":"#N/A"},{"$f":"IF(ISNUMBER('2_Combustibles fósiles'!I34),'2_Combustibles fósiles'!G34*'2_Combustibles fósiles'!I34,IF(ISNUMBER('2_Combustibles fósiles'!H34),'2_Combustibles fósiles'!H34*'2_Combustibles fósiles'!G34,\"\"))","v":""}]
[null,null,{"$f":"'2_Combustibles fósiles'!F35","v":{"v":0,"d":"0.000"}},"E85 (l)",{"$f":"'7_Factores de emisión'!G15","v":0.344},{"$f":"'7_Factores de emisión'!H15","v":0.344},{"$f":"'7_Factores de emisión'!I15","v":0.344},{"$f":"'7_Factores de emisión'!J15","v":0.344},{"$f":"'7_Factores de emisión'!K15","v":0.344},{"$f":"'7_Factores de emisión'!L15","v":0.344},{"$f":"'7_Factores de emisión'!M15","v":0.344},{"$f":"'7_Factores de emisión'!N15","v":0.344},{"$f":"'7_Factores de emisión'!O15","v":0.344},{"$f":"'7_Factores de emisión'!P15","v":0.344},null,null,{"$error":"#N/A"},{"$f":"IF(ISNUMBER('2_Combustibles fósiles'!I35),'2_Combustibles fósiles'!G35*'2_Combustibles fósiles'!I35,IF(ISNUMBER('2_Combustibles fósiles'!H35),'2_Combustibles fósiles'!H35*'2_Combustibles fósiles'!G35,\"\"))","v":""}]
[null,null,{"$f":"'2_Combustibles fósiles'!F36","v":{"v":0,"d":"0.000"}},"E100 (l)",{"$f":"'7_Factores de emisión'!G16","v":{"v":0,"d":"0.000"}},{"$f":"'7_Factores de emisión'!H16","v":{"v":0,"d":"0.000"}},{"$f":"'7_Factores de emisión'!I16","v":{"v":0,"d":"0.000"}},{"$f":"'7_Factores de emisión'!J16","v":{"v":0,"d":"0.000"}},{"$f":"'7_Factores de emisión'!K16","v":{"v":0,"d":"0.000"}},{"$f":"'7_Factores de emisión'!L16","v":{"v":0,"d":"0.000"}},{"$f":"'7_Factores de emisión'!M16","v":{"v":0,"d":"0.000"}},{"$f":"'7_Factores de emisión'!N16","v":{"v":0,"d":"0.000"}},{"$f":"'7_Factores de emisión'!O16","v":{"v":0,"d":"0.000"}},{"$f":"'7_Factores de emisión'!P16","v":{"v":0,"d":"0.000"}},null,null,{"$error":"#N/A"},{"$f":"IF(ISNUMBER('2_Combustibles fósiles'!I36),'2_Combustibles fósiles'!G36*'2_Combustibles fósiles'!I36,IF(ISNUMBER('2_Combustibles fósiles'!H36),'2_Combustibles fósiles'!H36*'2_Combustibles fósiles'!G36,\"\"))","v":""}]
[null,null,{"$f":"'2_Combustibles fósiles'!F37","v":{"v":0,"d":"0.000"}},"B7 (l)",{"$f":"'7_Factores de emisión'!G17","v":2.467},{"$f":"'7_Factores de emisión'!H17","v":2.467},{"$f":"'7_Factores de emisión'!I17","v":2.467},{"$f":"'7_Factores de emisión'!J17","v":2.467},{"$f":"'7_Factores de emisión'!K17","v":2.467},{"$f":"'7_Factores de emisión'!L17","v":2.467},{"$f":"'7_Factores de emisión'!M17","v":2.467},{"$f":"'7_Factores de emisión'!N17","v":2.467},{"$f":"'7_Factores de emisión'!O17","v":2.467},{"$f":"'7_Factores de emisión'!P17","v":2.467},null,null,{"$f":"VLOOKUP(C106,$D$87:$N$111,$F$2-2008,0)","v":{"$error":"#N/A"}},{"$f":"IF(ISNUMBER('2_Combustibles fósiles'!I37),'2_Combustibles fósiles'!G37*'2_Combustibles fósiles'!I37,IF(ISNUMBER('2_Combustibles fósiles'!H37),'2_Combustibles fósiles'!H37*'2_Combustibles fósiles'!G37,\"\"))","v":""}]
[null,null,{"$f":"'2_Combustibles fósiles'!F38","v":{"v":0,"d":"0.000"}},"B10 (l)",{"$f":"'7_Factores de emisión'!G18","v":2.387},{"$f":"'7_Factores de emisión'!H18","v":2.387},{"$f":"'7_Factores de emisión'!I18","v":2.387},{"$f":"'7_Factores de emisión'!J18","v":2.387},{"$f":"'7_Factores de emisión'!K18","v":2.387},{"$f":"'7_Factores de emisión'!L18","v":2.387},{"$f":"'7_Factores de emisión'!M18","v":2.387},{"$f":"'7_Factores de emisión'!N18","v":2.387},{"$f":"'7_Factores de emisión'!O18","v":2.387},{"$f":"'7_Factores de emisión'!P18","v":2.387},null,null,{"$error":"#N/A"},{"$f":"IF(ISNUMBER('2_Combustibles fósiles'!I38),'2_Combustibles fósiles'!G38*'2_Combustibles fósiles'!I38,IF(ISNUMBER('2_Combustibles fósiles'!H38),'2_Combustibles fósiles'!H38*'2_Combustibles fósiles'!G38,\"\"))","v":""}]
[null,null,{"$f":"'2_Combustibles fósiles'!F39","v":{"v":0,"d":"0.000"}},"B20 (l)",{"$f":"'7_Factores de emisión'!G19","v":2.122},{"$f":"'7_Factores de emisión'!H19","v":2.122},{"$f":"'7_Factores de emisión'!I19","v":2.122},{"$f":"'7_Factores de emisión'!J19","v":2.122},{"$f":"'7_Factores de emisión'!K19","v":2.122},{"$f":"'7_Factores de emisión'!L19","v":2.122},{"$f":"'7_Factores de emisión'!M19","v":2.122},{"$f":"'7_Factores de emisión'!N19","v":2.122},{"$f":"'7_Factores de emisión'!O19","v":2.122},{"$f":"'7_Factores de emisión'!P19","v":2.122},null,null,{"$error":"#N/A"},{"$f":"IF(ISNUMBER('2_Combustibles fósiles'!I39),'2_Combustibles fósiles'!G39*'2_Combustibles fósiles'!I39,IF(ISNUMBER('2_Combustibles fósiles'!H39),'2_Combustibles fósiles'!H39*'2_Combustibles fósiles'!G39,\"\"))","v":""}]
[{"$nulls":3},"B30 (l)",{"$f":"'7_Factores de emisión'!G20","v":1.857},{"$f":"'7_Factores de emisión'!H20","v":1.857},{"$f":"'7_Factores de emisión'!I20","v":1.857},{"$f":"'7_Factores de emisión'!J20","v":1.857},{"$f":"'7_Factores de emisión'!K20","v":1.857},{"$f":"'7_Factores de emisión'!L20","v":1.857},{"$f":"'7_Factores de emisión'!M20","v":1.857},{"$f":"'7_Factores de emisión'!N20","v":1.857},{"$f":"'7_Factores de emisión'!O20","v":1.857},{"$f":"'7_Factores de emisión'!P20","v":1.857}]
[{"$nulls":3},"B100 (l)",{"$f":"'7_Factores de emisión'!G21","v":{"v":0,"d":"0.000"}},{"$f":"'7_Factores de emisión'!H21","v":{"v":0,"d":"0.000"}},{"$f":"'7_Factores de emisión'!I21","v":{"v":0,"d":"0.000"}},{"$f":"'7_Factores de emisión'!J21","v":{"v":0,"d":"0.000"}},{"$f":"'7_Factores de emisión'!K21","v":{"v":0,"d":"0.000"}},{"$f":"'7_Factores de emisión'!L21","v":{"v":0,"d":"0.000"}},{"$f":"'7_Factores de emisión'!M21","v":{"v":0,"d":"0.000"}},{"$f":"'7_Factores de emisión'!N21","v":{"v":0,"d":"0.000"}},{"$f":"'7_Factores de emisión'!O21","v":{"v":0,"d":"0.000"}},{"$f":"'7_Factores de emisión'!P21","v":{"v":0,"d":"0.000"}}]
[{"$nulls":3},"Otros (ud)","-","-","-","-","-","-","-","-","-","-"]
[]
[null,"Desplazamientos",null,1,2,3,4,5,6,7,8,9,10,11]
[null,null,"Propulsión escogida","Lista tipo de \ncombustible 2010-2018","Multiplicador\n2010","Multiplicador\n2011","Multiplicador\n2012","Multiplicador\n2013","Multiplicador\n2014","Multiplicador\n2015","Multiplicador\n2016","Multiplicador\n2017","Multiplicador\n2018","Multiplicador\n2019",null,"Fórmula desde 2010 hasta 2018","Fórmula B1","Fórmula B2",null,"Resultado móviles"]
[null,null,{"$f":"'2_Combustibles fósiles'!F62","v":0},"Gasolina (l)",{"$f":"'7_Factores de emisión'!G9","v":2.295},{"$f":"'7_Factores de emisión'!H9","v":2.205},{"$f":"'7_Factores de emisión'!I9","v":2.201},{"$f":"'7_Factores de emisión'!J9","v":2.205},{"$f":"'7_Factores de emisión'!K9","v":2.205},{"$f":"'7_Factores de emisión'!L9","v":2.205},{"$f":"'7_Factores de emisión'!M9","v":2.196},{"$f":"'7_Factores de emisión'!N9","v":{"v":2.18,"d":"2.180"}},{"$f":"'7_Factores de emisión'!O9","v":2.157},{"$f":"'7_Factores de emisión'!P9","v":"-"},null,{"$f":"VLOOKUP(C115,$D$115:$N$133,$F$2-2008,0)","v":{"$error":"#N/A"}},{"$f":"IF(ISNUMBER('2_Combustibles fósiles'!H62),'2_Combustibles fósiles'!H62*'2_Combustibles fósiles'!I62,IF(ISNUMBER('2_Combustibles fósiles'!G62),'2_Combustibles fósiles'!G62*'2_Combustibles fósiles'!I62,\"\"))","v":""},{"$f":"IF(ISNUMBER('2_Combustibles fósiles'!M62),('2_Combustibles fósiles'!M62*'2_Combustibles fósiles'!N62)/1000,0)","v":{"v":0,"d":"0.00"}},null,{"$f":"SUM(Q135+R135)","v":{"v":0,"d":"0.00"}}]
[null,null,{"$f":"'2_Combustibles fósiles'!F63","v":0},"Gasóleo A (l)",{"$f":"'7_Factores de emisión'!G10","v":2.653},{"$f":"'7_Factores de emisión'!H10","v":2.493},{"$f":"'7_Factores de emisión'!I10","v":2.467},{"$f":"'7_Factores de emisión'!J10","v":2.544},{"$f":"'7_Factores de emisión'!K10","v":2.544},{"$f":"'7_Factores de emisión'!L10","v":2.544},{"$f":"'7_Factores de emisión'!M10","v":2.539},{"$f":"'7_Factores de emisión'!N10","v":{"v":2.52,"d":"2.520"}},{"$f":"'7_Factores de emisión'!O10","v":2.493},{"$f":"'7_Factores de emisión'!P10","v":"-"},null,{"$f":"VLOOKUP(C116,$D$115:$N$133,$F$2-2008,0)","v":{"$error":"#N/A"}},{"$f":"IF(ISNUMBER('2_Combustibles fósiles'!H63),'2_Combustibles fósiles'!H63*'2_Combustibles fósiles'!I63,IF(ISNUMBER('2_Combustibles fósiles'!G63),'2_Combustibles fósiles'!G63*'2_Combustibles fósiles'!I63,\"\"))","v":""},{"$f":"IF(ISNUMBER('2_Combustibles fósiles'!M63),('2_Combustibles fósiles'!M63*'2_Combustibles fósiles'!N63)/1000,0)","v":{"v":0,"d":"0.00"}}]
[null,null,{"$f":"'2_Combustibles fósiles'!F64","v":0},"Gasóleo B (l)",{"$f":"'7_Factores de emisión'!G11","v":2.708},{"$f":"'7_Factores de emisión'!H11","v":2.708},{"$f":"'7_Factores de emisión'!I11","v":2.708},{"$f":"'7_Factores de emisión'!J11","v":2.708},{"$f":"'7_Factores de emisión'!K11","v":2.708},{"$f":"'7_Factores de emisión'!L11","v":2.708},{"$f":"'7_Factores de emisión'!M11","v":2.708},{"$f":"'7_Factores de emisión'!N11","v":2.708},{"$f":"'7_Factores de emisión'!O11","v":2.708},{"$f":"'7_Factores de emisión'!P11","v":2.708},null,{"$error":"#N/A"},{"$f":"IF(ISNUMBER('2_Combustibles fósiles'!H64),'2_Combustibles fósiles'!H64*'2_Combustibles fósiles'!I64,IF(ISNUMBER('2_Combustibles fósiles'!G64),'2_Combustibles fósiles'!G64*'2_Combustibles fósiles'!I64,\"\"))","v":""},{"$f":"IF(ISNUMBER('2_Combustibles fósiles'!M64),('2_Combustibles fósiles'!M64*'2_Combustibles fósiles'!N64)/1000,0)","v":{"v":0,"d":"0.00"}}]
[null,null,{"$f":"'2_Combustibles fósiles'!F65","v":0},"E5 (l)",{"$f":"'7_Factores de emisión'!G13","v":{"v":2.18,"d":"2.180"}},{"$f":"'7_Factores de emisión'!H13","v":{"v":2.18,"d":"2.180"}},{"$f":"'7_Factores de emisión'!I13","v":{"v":2.18,"d":"2.180"}},{"$f":"'7_Factores de emisión'!J13","v":{"v":2.18,"d":"2.180"}},{"$f":"'7_Factores de emisión'!K13","v":{"v":2.18,"d":"2.180"}},{"$f":"'7_Factores de emisión'!L13","v":{"v":2.18,"d":"2.180"}},{"$f":"'7_Factores de emisión'!M13","v":{"v":2.18,"d":"2.180"}},{"$f":"'7_Factores de emisión'!N13","v":{"v":2.18,"d":"2.180"}},{"$f":"'7_Factores de emisión'!O13","v":{"v":2.18,"d":"2.180"}},{"$f":"'7_Factores de emisión'!P13","v":{"v":2.18,"d":"2.180"}},null,{"$error":"#N/A"},{"$f":"IF(ISNUMBER('2_Combustibles fósiles'!H65),'2_Combustibles fósiles'!H65*'2_Combustibles fósiles'!I65,IF(ISNUMBER('2_Combustibles fósiles'!G65),'2_Combustibles fósiles'!G65*'2_Combustibles fósiles'!I65,\"\"))","v":""},{"$f":"IF(ISNUMBER('2_Combustibles fósiles'!M65),('2_Combustibles fósiles'!M65*'2_Combustibles fósiles'!N65)/1000,0)","v":{"v":0,"d":"0.00"}}]
[null,null,{"$f":"'2_Combustibles fósiles'!F66","v":0},"E10 (l)",{"$f":"'7_Factores de emisión'!G14","v":2.065},{"$f":"'7_Factores de emisión'!H14","v":2.065},{"$f":"'7_Factores de emisión'!I14","v":2.065},{"$f":"'7_Factores de emisión'!J14","v":2.065},{"$f":"'7_Factores de emisión'!K14","v":2.065},{"$f":"'7_Factores de emisión'!L14","v":2.065},{"$f":"'7_Factores de emisión'!M14","v":2.065},{"$f":"'7_Factores de emisión'!N14","v":2.065},{"$f":"'7_Factores de emisión'!O14","v":2.065},{"$f":"'7_Factores de emisión'!P14","v":2.065},null,{"$error":"#N/A"},{"$f":"IF(ISNUMBER('2_Combustibles fósiles'!H66),'2_Combustibles fósiles'!H66*'2_Combustibles fósiles'!I66,IF(ISNUMBER('2_Combustibles fósiles'!G66),'2_Combustibles fósiles'!G66*'2_Combustibles fósiles'!I66,\"\"))","v":""},{"$f":"IF(ISNUMBER('2_Combustibles fósiles'!M66),('2_Combustibles fósiles'!M66*'2_Combustibles fósiles'!N66)/1000,0)","v":{"v":0,"d":"0.00"}}]
[null,null,{"$f":"'2_Combustibles fósiles'!F67","v":0},"E85 (l)",{"$f":"'7_Factores de emisión'!G15","v":0.344},{"$f":"'7_Factores de emisión'!H15","v":0.344},{"$f":"'7_Factores de emisión'!I15","v":0.344},{"$f":"'7_Factores de emisión'!J15","v":0.344},{"$f":"'7_Factores de emisión'!K15","v":0.344},{"$f":"'7_Factores de emisión'!L15","v":0.344},{"$f":"'7_Factores de emisión'!M15","v":0.344},{"$f":"'7_Factores de emisión'!N15","v":0.344},{"$f":"'7_Factores de emisión'!O15","v":0.344},{"$f":"'7_Factores de emisión'!P15","v":0.344},null,{"$error":"#N/A"},{"$f":"IF(ISNUMBER('2_Combustibles fósiles'!H67),'2_Combustibles fósiles'!H67*'2_Combustibles fósiles'!I67,IF(ISNUMBER('2_Combustibles fósiles'!G67),'2_Combustibles fósiles'!G67*'2_Combustibles fósiles'!I67,\"\"))","v":""},{"$f":"IF(ISNUMBER('2_Combustibles fósiles'!M67),('2_Combustibles fósiles'!M67*'2_Combustibles fósiles'!N67)/1000,0)","v":{"v":0,"d":"0.00"}}]
[null,null,{"$f":"'2_Combustibles fósiles'!F68","v":0},"E100 (l)",{"$f":"'7_Factores de emisión'!G16","v":{"v":0,"d":"0.000"}},{"$f":"'7_Factores de emisión'!H16","v":{"v":0,"d":"0.000"}},{"$f":"'7_Factores de emisión'!I16","v":{"v":0,"d":"0.000"}},{"$f":"'7_Factores de emisión'!J16","v":{"v":0,"d":"0.000"}},{"$f":"'7_Factores de emisión'!K16","v":{"v":0,"d":"0.000"}},{"$f":"'7_Factores de emisión'!L16","v":{"v":0,"d":"0.000"}},{"$f":"'7_Factores de emisión'!M16","v":{"v":0,"d":"0.000"}},{"$f":"'7_Factores de emisión'!N16","v":{"v":0,"d":"0.000"}},{"$f":"'7_Factores de emisión'!O16","v":{"v":0,"d":"0.000"}},{"$f":"'7_Factores de emisión'!P16","v":{"v":0,"d":"0.000"}},null,{"$error":"#N/A"},{"$f":"IF(ISNUMBER('2_Combustibles fósiles'!H68),'2_Combustibles fósiles'!H68*'2_Combustibles fósiles'!I68,IF(ISNUMBER('2_Combustibles fósiles'!G68),'2_Combustibles fósiles'!G68*'2_Combustibles fósiles'!I68,\"\"))","v":""},{"$f":"IF(ISNUMBER('2_Combustibles fósiles'!M68),('2_Combustibles fósiles'!M68*'2_Combustibles fósiles'!N68)/1000,0)","v":{"v":0,"d":"0.00"}}]
[null,null,{"$f":"'2_Combustibles fósiles'!F69","v":0},"B7 (l)",{"$f":"'7_Factores de emisión'!G17","v":2.467},{"$f":"'7_Factores de emisión'!H17","v":2.467},{"$f":"'7_Factores de emisión'!I17","v":2.467},{"$f":"'7_Factores de emisión'!J17","v":2.467},{"$f":"'7_Factores de emisión'!K17","v":2.467},{"$f":"'7_Factores de emisión'!L17","v":2.467},{"$f":"'7_Factores de emisión'!M17","v":2.467},{"$f":"'7_Factores de emisión'!N17","v":2.467},{"$f":"'7_Factores de emisión'!O17","v":2.467},{"$f":"'7_Factores de emisión'!P17","v":2.467},null,{"$error":"#N/A"},{"$f":"IF(ISNUMBER('2_Combustibles fósiles'!H69),'2_Combustibles fósiles'!H69*'2_Combustibles fósiles'!I69,IF(ISNUMBER('2_Combustibles fósiles'!G69),'2_Combustibles fósiles'!G69*'2_Combustibles fósiles'!I69,\"\"))","v":""},{"$f":"IF(ISNUMBER('2_Combustibles fósiles'!M69),('2_Combustibles fósiles'!M69*'2_Combustibles fósiles'!N69)/1000,0)","v":{"v":0,"d":"0.00"}}]
[null,null,{"$f":"'2_Combustibles fósiles'!F70","v":0},"B10 (l)",{"$f":"'7_Factores de emisión'!G18","v":2.387},{"$f":"'7_Factores de emisión'!H18","v":2.387},{"$f":"'7_Factores de emisión'!I18","v":2.387},{"$f":"'7_Factores de emisión'!J18","v":2.387},{"$f":"'7_Factores de emisión'!K18","v":2.387},{"$f":"'7_Factores de emisión'!L18","v":2.387},{"$f":"'7_Factores de emisión'!M18","v":2.387},{"$f":"'7_Factores de emisión'!N18","v":2.387},{"$f":"'7_Factores de emisión'!O18","v":2.387},{"$f":"'7_Factores de emisión'!P18","v":2.387},null,{"$error":"#N/A"},{"$f":"IF(ISNUMBER('2_Combustibles fósiles'!H70),'2_Combustibles fósiles'!H70*'2_Combustibles fósiles'!I70,IF(ISNUMBER('2_Combustibles fósiles'!G70),'2_Combustibles fósiles'!G70*'2_Combustibles fósiles'!I70,\"\"))","v":""},{"$f":"IF(ISNUMBER('2_Combustibles fósiles'!M70),('2_Combustibles fósiles'!M70*'2_Combustibles fósiles'!N70)/1000,0)","v":{"v":0,"d":"0.00"}}]
[null,null,{"$f":"'2_Combustibles fósiles'!F71","v":0},"B20 (l)",{"$f":"'7_Factores de emisión'!G19","v":2.122},{"$f":"'7_Factores de emisión'!H19","v":2.122},{"$f":"'7_Factores de emisión'!I19","v":2.122},{"$f":"'7_Factores de emisión'!J19","v":2.122},{"$f":"'7_Factores de emisión'!K19","v":2.122},{"$f":"'7_Factores de emisión'!L19","v":2.122},{"$f":"'7_Factores de emisión'!M19","v":2.122},{"$f":"'7_Factores de emisión'!N19","v":2.122},{"$f":"'7_Factores de emisión'!O19","v":2.122},{"$f":"'7_Factores de emisión'!P19","v":2.122},null,{"$error":"#N/A"},{"$f":"IF(ISNUMBER('2_Combustibles fósiles'!H71),'2_Combustibles fósiles'!H71*'2_Combustibles fósiles'!I71,IF(ISNUMBER('2_Combustibles fósiles'!G71),'2_Combustibles fósiles'!G71*'2_Combustibles fósiles'!I71,\"\"))","v":""},{"$f":"IF(ISNUMBER('2_Combustibles fósiles'!M71),('2_Combustibles fósiles'!M71*'2_Combustibles fósiles'!N71)/1000,0)","v":{"v":0,"d":"0.00"}}]
[null,null,{"$f":"'2_Combustibles fósiles'!F72","v":0},"B30 (l)",{"$f":"'7_Factores de emisión'!G20","v":1.857},{"$f":"'7_Factores de emisión'!H20","v":1.857},{"$f":"'7_Factores de emisión'!I20","v":1.857},{"$f":"'7_Factores de emisión'!J20","v":1.857},{"$f":"'7_Factores de emisión'!K20","v":1.857},{"$f":"'7_Factores de emisión'!L20","v":1.857},{"$f":"'7_Factores de emisión'!M20","v":1.857},{"$f":"'7_Factores de emisión'!N20","v":1.857},{"$f":"'7_Factores de emisión'!O20","v":1.857},{"$f":"'7_Factores de emisión'!P20","v":1.857},null,{"$error":"#N/A"},{"$f":"IF(ISNUMBER('2_Combustibles fósiles'!H72),'2_Combustibles fósiles'!H72*'2_Combustibles fósiles'!I72,IF(ISNUMBER('2_Combustibles fósiles'!G72),'2_Combustibles fósiles'!G72*'2_Combustibles fósiles'!I72,\"\"))","v":""},{"$f":"IF(ISNUMBER('2_Combustibles fósiles'!M72),('2_Combustibles fósiles'!M72*'2_Combustibles fósiles'!N72)/1000,0)","v":{"v":0,"d":"0.00"}}]
[null,null,{"$f":"'2_Combustibles fósiles'!F73","v":0},"B100 (l)",{"$f":"'7_Factores de emisión'!G21","v":{"v":0,"d":"0.000"}},{"$f":"'7_Factores de emisión'!H21","v":{"v":0,"d":"0.000"}},{"$f":"'7_Factores de emisión'!I21","v":{"v":0,"d":"0.000"}},{"$f":"'7_Factores de emisión'!J21","v":{"v":0,"d":"0.000"}},{"$f":"'7_Factores de emisión'!K21","v":{"v":0,"d":"0.000"}},{"$f":"'7_Factores de emisión'!L21","v":{"v":0,"d":"0.000"}},{"$f":"'7_Factores de emisión'!M21","v":{"v":0,"d":"0.000"}},{"$f":"'7_Factores de emisión'!N21","v":{"v":0,"d":"0.000"}},{"$f":"'7_Factores de emisión'!O21","v":{"v":0,"d":"0.000"}},{"$f":"'7_Factores de emisión'!P21","v":{"v":0,"d":"0.000"}},null,{"$error":"#N/A"},{"$f":"IF(ISNUMBER('2_Combustibles fósiles'!H73),'2_Combustibles fósiles'!H73*'2_Combustibles fósiles'!I73,IF(ISNUMBER('2_Combustibles fósiles'!G73),'2_Combustibles fósiles'!G73*'2_Combustibles fósiles'!I73,\"\"))","v":""},{"$f":"IF(ISNUMBER('2_Combustibles fósiles'!M73),('2_Combustibles fósiles'!M73*'2_Combustibles fósiles'!N73)/1000,0)","v":{"v":0,"d":"0.00"}}]
[null,null,{"$f":"'2_Combustibles fósiles'!F74","v":0},"XTL (l)",{"$f":"'7_Factores de emisión'!G22","v":{"v":0,"d":"0.000"}},{"$f":"'7_Factores de emisión'!H22","v":{"v":0,"d":"0.000"}},{"$f":"'7_Factores de emisión'!I22","v":{"v":0,"d":"0.000"}},{"$f":"'7_Factores de emisión'!J22","v":{"v":0,"d":"0.000"}},{"$f":"'7_Factores de emisión'!K22","v":{"v":0,"d":"0.000"}},{"$f":"'7_Factores de emisión'!L22","v":{"v":0,"d":"0.000"}},{"$f":"'7_Factores de emisión'!M22","v":{"v":0,"d":"0.000"}},{"$f":"'7_Factores de emisión'!N22","v":{"v":0,"d":"0.000"}},{"$f":"'7_Factores de emisión'!O22","v":{"v":0,"d":"0.000"}},{"$f":"'7_Factores de emisión'!P22","v":{"v":0,"d":"0.000"}},null,{"$error":"#N/A"},{"$f":"IF(ISNUMBER('2_Combustibles fósiles'!H74),'2_Combustibles fósiles'!H74*'2_Combustibles fósiles'!I74,IF(ISNUMBER('2_Combustibles fósiles'!G74),'2_Combustibles fósiles'!G74*'2_Combustibles fósiles'!I74,\"\"))","v":""},{"$f":"IF(ISNUMBER('2_Combustibles fósiles'!M74),('2_Combustibles fósiles'!M74*'2_Combustibles fósiles'!N74)/1000,0)","v":{"v":0,"d":"0.00"}}]
[null,null,{"$f":"'2_Combustibles fósiles'!F75","v":0},"LNG (kWh)*",{"$f":"'7_Factores de emisión'!G24","v":0.182},{"$f":"'7_Factores de emisión'!H24","v":0.182},{"$f":"'7_Factores de emisión'!I24","v":0.182},{"$f":"'7_Factores de emisión'!J24","v":0.182},{"$f":"'7_Factores de emisión'!K24","v":0.182},{"$f":"'7_Factores de emisión'!L24","v":0.182},{"$f":"'7_Factores de emisión'!M24","v":0.182},{"$f":"'7_Factores de emisión'!N24","v":0.183},{"$f":"'7_Factores de emisión'!O24","v":0.183},{"$f":"'7_Factores de emisión'!P24","v":0.182},null,{"$error":"#N/A"},{"$f":"IF(ISNUMBER('2_Combustibles fósiles'!H75),'2_Combustibles fósiles'!H75*'2_Combustibles fósiles'!I75,IF(ISNUMBER('2_Combustibles fósiles'!G75),'2_Combustibles fósiles'!G75*'2_Combustibles fósiles'!I75,\"\"))","v":""},{"$f":"IF(ISNUMBER('2_Combustibles fósiles'!M75),('2_Combustibles fósiles'!M75*'2_Combustibles fósiles'!N75)/1000,0)","v":{"v":0,"d":"0.00"}}]
[null,null,{"$f":"'2_Combustibles fósiles'!F76","v":0},"CNG (kWh)*",{"$f":"'7_Factores de emisión'!G25","v":0.182},{"$f":"'7_Factores de emisión'!H25","v":0.182},{"$f":"'7_Factores de emisión'!I25","v":0.182},{"$f":"'7_Factores de emisión'!J25","v":0.182},{"$f":"'7_Factores de emisión'!K25","v":0.182},{"$f":"'7_Factores de emisión'!L25","v":0.182},{"$f":"'7_Factores de emisión'!M25","v":0.182},{"$f":"'7_Factores de emisión'!N25","v":0.183},{"$f":"'7_Factores de emisión'!O25","v":0.183},{"$f":"'7_Factores de emisión'!P25","v":0.182},null,{"$error":"#N/A"},{"$f":"IF(ISNUMBER('2_Combustibles fósiles'!H76),'2_Combustibles fósiles'!H76*'2_Combustibles fósiles'!I76,IF(ISNUMBER('2_Combustibles fósiles'!G76),'2_Combustibles fósiles'!G76*'2_Combustibles fósiles'!I76,\"\"))","v":""},{"$f":"IF(ISNUMBER('2_Combustibles fósiles'!M76),('2_Combustibles fósiles'!M76*'2_Combustibles fósiles'!N76)/1000,0)","v":{"v":0,"d":"0.00"}}]
[null,null,{"$f":"'2_Combustibles fósiles'!F77","v":0},"LPG (l)",{"$f":"'7_Factores de emisión'!G26","v":1.671},{"$f":"'7_Factores de emisión'!H26","v":1.671},{"$f":"'7_Factores de emisión'!I26","v":1.671},{"$f":"'7_Factores de emisión'!J26","v":1.671},{"$f":"'7_Factores de emisión'!K26","v":1.671},{"$f":"'7_Factores de emisión'!L26","v":1.671},{"$f":"'7_Factores de emisión'!M26","v":1.671},{"$f":"'7_Factores de emisión'!N26","v":1.671},{"$f":"'7_Factores de emisión'!O26","v":1.671},{"$f":"'7_Factores de emisión'!P26","v":1.671},null,{"$error":"#N/A"},{"$f":"IF(ISNUMBER('2_Combustibles fósiles'!H77),'2_Combustibles fósiles'!H77*'2_Combustibles fósiles'!I77,IF(ISNUMBER('2_Combustibles fósiles'!G77),'2_Combustibles fósiles'!G77*'2_Combustibles fósiles'!I77,\"\"))","v":""},{"$f":"IF(ISNUMBER('2_Combustibles fósiles'!M77),('2_Combustibles fósiles'!M77*'2_Combustibles fósiles'!N77)/1000,0)","v":{"v":0,"d":"0.00"}}]
[null,null,{"$f":"'2_Combustibles fósiles'!F78","v":0},"H2 (kg)",{"$f":"'7_Factores de emisión'!G27","v":{"v":0,"d":"0.000"}},{"$f":"'7_Factores de emisión'!H27","v":{"v":0,"d":"0.000"}},{"$f":"'7_Factores de emisión'!I27","v":{"v":0,"d":"0.000"}},{"$f":"'7_Factores de emisión'!J27","v":{"v":0,"d":"0.000"}},{"$f":"'7_Factores de emisión'!K27","v":{"v":0,"d":"0.000"}},{"$f":"'7_Factores de emisión'!L27","v":{"v":0,"d":"0.000"}},{"$f":"'7_Factores de emisión'!M27","v":{"v":0,"d":"0.000"}},{"$f":"'7_Factores de emisión'!N27","v":{"v":0,"d":"0.000"}},{"$f":"'7_Factores de emisión'!O27","v":{"v":0,"d":"0.000"}},{"$f":"'7_Factores de emisión'!P27","v":{"v":0,"d":"0.000"}},null,{"$error":"#N/A"},{"$f":"IF(ISNUMBER('2_Combustibles fósiles'!H78),'2_Combustibles fósiles'!H78*'2_Combustibles fósiles'!I78,IF(ISNUMBER('2_Combustibles fósiles'!G78),'2_Combustibles fósiles'!G78*'2_Combustibles fósiles'!I78,\"\"))","v":""},{"$f":"IF(ISNUMBER('2_Combustibles fósiles'!M78),('2_Combustibles fósiles'!M78*'2_Combustibles fósiles'!N78)/1000,0)","v":{"v":0,"d":"0.00"}}]
[null,null,{"$f":"'2_Combustibles fósiles'!F79","v":0},"Fuelóleo (kg)",{"$f":"'7_Factores de emisión'!G30","v":3.127},{"$f":"'7_Factores de emisión'!H30","v":3.127},{"$f":"'7_Factores de emisión'!I30","v":3.127},{"$f":"'7_Factores de emisión'!J30","v":3.127},{"$f":"'7_Factores de emisión'!K30","v":3.127},{"$f":"'7_Factores de emisión'!L30","v":3.127},{"$f":"'7_Factores de emisión'!M30","v":3.127},{"$f":"'7_Factores de emisión'!N30","v":3.127},{"$f":"'7_Factores de emisión'!O30","v":3.127},{"$f":"'7_Factores de emisión'!P30","v":3.127},null,{"$error":"#N/A"},{"$f":"IF(ISNUMBER('2_Combustibles fósiles'!H79),'2_Combustibles fósiles'!H79*'2_Combustibles fósiles'!I79,IF(ISNUMBER('2_Combustibles fósiles'!G79),'2_Combustibles fósiles'!G79*'2_Combustibles fósiles'!I79,\"\"))","v":""},{"$f":"IF(ISNUMBER('2_Combustibles fósiles'!M79),('2_Combustibles fósiles'!M79*'2_Combustibles fósiles'!N79)/1000,0)","v":{"v":0,"d":"0.00"}}]
[null,null,{"$f":"'2_Combustibles fósiles'!F80","v":0},"Otros (ud)","-","-","-","-","-","-","-","-","-","-",null,{"$f":"VLOOKUP(C133,$D$115:$N$133,$F$2-2008,0)","v":{"$error":"#N/A"}},{"$f":"IF(ISNUMBER('2_Combustibles fósiles'!H80),'2_Combustibles fósiles'!H80*'2_Combustibles fósiles'!I80,IF(ISNUMBER('2_Combustibles fósiles'!G80),'2_Combustibles fósiles'!G80*'2_Combustibles fósiles'!I80,\"\"))","v":""},{"$f":"IF(ISNUMBER('2_Combustibles fósiles'!M80),('2_Combustibles fósiles'!M80*'2_Combustibles fósiles'!N80)/1000,0)","v":{"v":0,"d":"0.00"}}]
[null,null,{"$f":"'2_Combustibles fósiles'!F81","v":0},{"$nulls":12},{"$error":"#N/A"},{"$f":"IF(ISNUMBER('2_Combustibles fósiles'!H81),'2_Combustibles fósiles'!H81*'2_Combustibles fósiles'!I81,IF(ISNUMBER('2_Combustibles fósiles'!G81),'2_Combustibles fósiles'!G81*'2_Combustibles fósiles'!I81,\"\"))","v":""},{"$f":"IF(ISNUMBER('2_Combustibles fósiles'!M81),('2_Combustibles fósiles'!M81*'2_Combustibles fósiles'!N81)/1000,0)","v":{"v":0,"d":"0.00"}}]
[{"$nulls":16},{"$f":"'2_Combustibles fósiles'!J82","v":{"v":0,"d":"0.00"}},{"$f":"'2_Combustibles fósiles'!O82","v":{"v":0,"d":"0.00"}}]
["3_Fluorados"]
[null,null,"Refrigerante escogido","Fórmula química","Lista refrigerantes","Fórmula química","PCA","Fórmula","Fórmula PCA",null,"Fórmula","Fórmula","Fórmula",{"$nulls":6},"Resultado fluorados"]
[null,null,{"$f":"'3_Fluorados'!F12","v":0},{"$f":"'7_Factores de emisión'!F92","v":"CH2F3"},{"$f":"'7_Factores de emisión'!E92","v":"HFC-23"},{"$f":"D138","v":"CH2F3"},{"$f":"'7_Factores de emisión'!G92","v":{"v":14800,"d":"14,800"}},{"$f":"VLOOKUP(C138,$E$138:$G$181,2,0)","v":{"$error":"#N/A"}},{"$f":"VLOOKUP(C138,$E$138:$G$181,3,0)","v":{"$error":"#N/A"}},null,{"$f":"VLOOKUP(C138,$E$138:$F$181,2,0)","v":{"$error":"#N/A"}},{"$f":"ISNONTEXT(K138)","v":true},{"$f":"IF(L138=FALSE,K138,\"\")","v":""},{"$nulls":6},{"$f":"'3_Fluorados'!O12","v":{"v":0,"d":"0.00"}}]
[null,null,{"$f":"'3_Fluorados'!F13","v":0},{"$f":"'7_Factores de emisión'!F93","v":"CH2F2"},{"$f":"'7_Factores de emisión'!E93","v":"HFC-32"},{"$f":"D139","v":"CH2F2"},{"$f":"'7_Factores de emisión'!G93","v":675},{"$error":"#N/A"},{"$error":"#N/A"},null,{"$error":"#N/A"},{"$f":"ISNONTEXT(K139)","v":true},{"$f":"IF(L139=FALSE,K139,\"\")","v":""}]
[null,null,{"$f":"'3_Fluorados'!F14","v":0},{"$f":"'7_Factores de emisión'!F94","v":"CH3F"},{"$f":"'7_Factores de emisión'!E94","v":"HFC-41"},"CH3F",{"$f":"'7_Factores de emisión'!G94","v":92},{"$error":"#N/A"},{"$error":"#N/A"},null,{"$error":"#N/A"},true,""]
[null,null,{"$f":"'3_Fluorados'!F15","v":0},{"$f":"'7_Factores de emisión'!F95","v":"C2HF5"},{"$f":"'7_Factores de emisión'!E95","v":"HFC-125"},"C2HF5",{"$f":"'7_Factores de emisión'!G95","v":{"v":3500,"d":"3,500"}},{"$error":"#N/A"},{"$error":"#N/A"},null,{"$error":"#N/A"},true,""]
[null,null,{"$f":"'3_Fluorados'!F16","v":0},{"$f":"'7_Factores de emisión'!F96","v":"C2H2F4"},{"$f":"'7_Factores de emisión'!E96","v":"HFC-134"},"C2H2F4",{"$f":"'7_Factores de emisión'!G96","v":{"v":1100,"d":"1,100"}},{"$error":"#N/A"},{"$error":"#N/A"},null,{"$error":"#N/A"},true,""]
[null,null,{"$f":"'3_Fluorados'!F17","v":0},{"$f":"'7_Factores de emisión'!F97","v":"CH2FCF3"},{"$f":"'7_Factores de emisión'!E97","v":"HFC-134a"},"CH2FCF3",{"$f":"'7_Factores de emisión'!G97","v":{"v":1430,"d":"1,430"}},{"$error":"#N/A"},{"$error":"#N/A"},null,{"$error":"#N/A"},true,""]
[null,null,{"$f":"'3_Fluorados'!F18","v":0},{"$f":"'7_Factores de emisión'!F98","v":"C2H3F3."},{"$f":"'7_Factores de emisión'!E98","v":"HFC-143"},"C2H3F3.",{"$f":"'7_Factores de emisión'!G98","v":353},{"$error":"#N/A"},{"$error":"#N/A"},null,{"$error":"#N/A"},true,""]
[null,null,{"$f":"'3_Fluorados'!F19","v":0},{"$f":"'7_Factores de emisión'!F99","v":"C2H3F3"},{"$f":"'7_Factores de emisión'!E99","v":"HFC-143a"},"C2H3F3",{"$f":"'7_Factores de emisión'!G99","v":{"v":4470,"d":"4,470"}},{"$error":"#N/A"},{"$error":"#N/A"},null,{"$error":"#N/A"},true,""]
[null,null,{"$f":"'3_Fluorados'!F20","v":0},{"$f":"'7_Factores de emisión'!F100","v":"CH2FCH2F"},{"$f":"'7_Factores de emisión'!E100","v":"HFC-152"},"CH2FCH2F",{"$f":"'7_Factores de emisión'!G100","v":53},{"$error":"#N/A"},{"$error":"#N/A"},null,{"$error":"#N/A"},true,""]
[null,null,{"$f":"'3_Fluorados'!F21","v":0},{"$f":"'7_Factores de emisión'!F101","v":"C2H4F2"},{"$f":"'7_Factores de emisión'!E101","v":"HFC-152a"},"C2H4F2",{"$f":"'7_Factores de emisión'!G101","v":124},{"$error":"#N/A"},{"$error":"#N/A"},null,{"$error":"#N/A"},true,""]
[null,null,{"$f":"'3_Fluorados'!F22","v":0},{"$f":"'7_Factores de emisión'!F102","v":"C2H2F"},{"$f":"'7_Factores de emisión'!E102","v":"HFC-161"},"C2H2F",{"$f":"'7_Factores de emisión'!G102","v":12},{"$error":"#N/A"},{"$error":"#N/A"},null,{"$error":"#N/A"},true,""]
[null,null,{"$f":"'3_Fluorados'!F23","v":0},{"$f":"'7_Factores de emisión'!F103","v":"C3HF7"},{"$f":"'7_Factores de emisión'!E103","v":"HFC-227ea"},"C3HF7",{"$f":"'7_Factores de emisión'!G103","v":{"v":3220,"d":"3,220"}},{"$error":"#N/A"},{"$error":"#N/A"},null,{"$error":"#N/A"},true,""]
[null,null,{"$f":"'3_Fluorados'!F24","v":0},{"$f":"'7_Factores de emisión'!F104","v":"CH2FCF2CF3"},{"$f":"'7_Factores de emisión'!E104","v":"HFC-236cb"},"CH2FCF2CF3",{"$f":"'7_Factores de emisión'!G104","v":{"v":1340,"d":"1,340"}},{"$error":"#N/A"},{"$error":"#N/A"},null,{"$error":"#N/A"},true,""]
[null,null,{"$f":"'3_Fluorados'!F25","v":0},{"$f":"'7_Factores de emisión'!F105","v":"CHF2CHFCF3"},{"$f":"'7_Factores de emisión'!E105","v":"HFC-236ea"},"CHF2CHFCF3",{"$f":"'7_Factores de emisión'!G105","v":{"v":1370,"d":"1,370"}},{"$error":"#N/A"},{"$error":"#N/A"},null,{"$error":"#N/A"},true,""]
[null,null,{"$f":"'3_Fluorados'!F26","v":0},{"$f":"'7_Factores de emisión'!F106","v":"C3H2F6"},{"$f":"'7_Factores de emisión'!E106","v":"HFC-236fa"},"C3H2F6",{"$f":"'7_Factores de emisión'!G106","v":{"v":9810,"d":"9,810"}},{"$error":"#N/A"},{"$error":"#N/A"},null,{"$error":"#N/A"},true,""]
[null,null,{"$f":"'3_Fluorados'!F27","v":0},{"$f":"'7_Factores de emisión'!F107","v":"C3H3F5"},{"$f":"'7_Factores de emisión'!E107","v":"HFC-245ca"},"C3H3F5",{"$f":"'7_Factores de emisión'!G107","v":693},{"$error":"#N/A"},{"$error":"#N/A"},null,{"$error":"#N/A"},true,""]
[null,null,{"$f":"'3_Fluorados'!F28","v":0},{"$f":"'7_Factores de emisión'!F108","v":"C3H3F5"},{"$f":"'7_Factores de emisión'!E108","v":"HFC-245fa"},"C3H3F5",{"$f":"'7_Factores de emisión'!G108","v":{"v":1030,"d":"1,030"}},{"$error":"#N/A"},{"$error":"#N/A"},null,{"$error":"#N/A"},true,""]
[null,null,{"$f":"'3_Fluorados'!F29","v":0},{"$f":"'7_Factores de emisión'!F109","v":"C4H5F5"},{"$f":"'7_Factores de emisión'!E109","v":"HFC-365mfc"},"C4H5F5",{"$f":"'7_Factores de emisión'!G109","v":794},{"$error":"#N/A"},{"$error":"#N/A"},null,{"$error":"#N/A"},true,""]
[null,null,{"$f":"'3_Fluorados'!F30","v":0},{"$f":"'7_Factores de emisión'!F110","v":"C5H2F10"},{"$f":"'7_Factores de emisión'!E110","v":"HFC-43-10mee"},"C5H2F10",{"$f":"'7_Factores de emisión'!G110","v":{"v":1640,"d":"1,640"}},{"$error":"#N/A"},{"$error":"#N/A"},null,{"$error":"#N/A"},true,""]
[null,null,{"$f":"'3_Fluorados'!F31","v":0},{"$f":"'7_Factores de emisión'!K92","v":"R-125/143a/134a (44/52/4)"},{"$f":"'7_Factores de emisión'!J92","v":"R-404A"},"R-125/143a/134a (44/52/4)",{"$f":"'7_Factores de emisión'!O92","v":{"v":3922,"d":"3,922"}},{"$error":"#N/A"},{"$error":"#N/A"},null,{"$error":"#N/A"},true,""]
[null,null,{"$f":"'3_Fluorados'!F32","v":0},{"$f":"'7_Factores de emisión'!K93","v":"R-32/125/134a (20/40/40)"},{"$f":"'7_Factores de emisión'!J93","v":"R-407A"},"R-32/125/134a (20/40/40)",{"$f":"'7_Factores de emisión'!O93","v":{"v":2107,"d":"2,107"}},{"$error":"#N/A"},{"$error":"#N/A"},null,{"$error":"#N/A"},true,""]
[null,null,{"$f":"'3_Fluorados'!F33","v":0},{"$f":"'7_Factores de emisión'!K94","v":"R-32/125/134a (10/70/20)  "},{"$f":"'7_Factores de emisión'!J94","v":"R-407B"},"R-32/125/134a (10/70/20)  ",{"$f":"'7_Factores de emisión'!O94","v":{"v":2804,"d":"2,804"}},{"$error":"#N/A"},{"$error":"#N/A"},null,{"$error":"#N/A"},true,""]
[{"$nulls":3},{"$f":"'7_Factores de emisión'!K95","v":"R-32/125/134a (23/25/52)"},{"$f":"'7_Factores de emisión'!J95","v":"R-407C"},"R-32/125/134a (23/25/52)",{"$f":"'7_Factores de emisión'!O95","v":{"v":1774,"d":"1,774"}}]
[{"$nulls":3},{"$f":"'7_Factores de emisión'!K96","v":"R-32/125/134a (30/30/40)"},{"$f":"'7_Factores de emisión'!J96","v":"R-407F"},"R-32/125/134a (30/30/40)",{"$f":"'7_Factores de emisión'!O96","v":{"v":1825,"d":"1,825"}}]
[{"$nulls":3},{"$f":"'7_Factores de emisión'!K97","v":"R-32/125 (50/50) "},{"$f":"'7_Factores de emisión'!J97","v":"R-410A"},"R-32/125 (50/50) ",{"$f":"'7_Factores de emisión'!O97","v":{"v":2088,"d":"2,088"}}]
[{"$nulls":3},{"$f":"'7_Factores de emisión'!K98","v":"R-32/125 (45/55) "},{"$f":"'7_Factores de emisión'!J98","v":"R-410B"},"R-32/125 (45/55) ",{"$f":"'7_Factores de emisión'!O98","v":{"v":2229,"d":"2,229"}}]
[{"$nulls":3},{"$f":"'7_Factores de emisión'!K99","v":"R-218/134a/600a (9/88/3)"},{"$f":"'7_Factores de emisión'!J99","v":"R-413A"},"R-218/134a/600a (9/88/3)",{"$f":"'7_Factores de emisión'!O99","v":{"v":2053,"d":"2,053"}}]
[{"$nulls":3},{"$f":"'7_Factores de emisión'!K100","v":"R-125/134a/600 (46,6/50/3,4)"},{"$f":"'7_Factores de emisión'!J100","v":"R-417A"},"R-125/134a/600 (46,6/50/3,4)",{"$f":"'7_Factores de emisión'!O100","v":{"v":2346,"d":"2,346"}}]
[{"$nulls":3},{"$f":"'7_Factores de emisión'!K101","v":"R-125/134a/600 (79/18,25/2,75)"},{"$f":"'7_Factores de emisión'!J101","v":"R-417B"},"R-125/134a/600 (79/18,25/2,75)",{"$f":"'7_Factores de emisión'!O101","v":{"v":3026,"d":"3,026"}}]
[{"$nulls":3},{"$f":"'7_Factores de emisión'!K102","v":"R-125/134a/600a (85,1/11,5/3,4)"},{"$f":"'7_Factores de emisión'!J102","v":"R-422A"},"R-125/134a/600a (85,1/11,5/3,4)",{"$f":"'7_Factores de emisión'!O102","v":{"v":3143,"d":"3,143"}}]
[{"$nulls":3},{"$f":"'7_Factores de emisión'!K103","v":"R-125/134a/600a (65,1/31,5/3,4)"},{"$f":"'7_Factores de emisión'!J103","v":"R-422D"},"R-125/134a/600a (65,1/31,5/3,4)",{"$f":"'7_Factores de emisión'!O103","v":{"v":2729,"d":"2,729"}}]
[{"$nulls":3},{"$f":"'7_Factores de emisión'!K104","v":"R-125/134a/600a/600/601a (50,5/47/0,9/1/0)"},{"$f":"'7_Factores de emisión'!J104","v":"R-424A"},"R-125/134a/600a/600/601a (50,5/47/0,9/1/0)",{"$f":"'7_Factores de emisión'!O104","v":{"v":2440,"d":"2,440"}}]
[{"$nulls":3},{"$f":"'7_Factores de emisión'!K105","v":"R-134a/125/600/601a (93/5,1/1,3/0,6)"},{"$f":"'7_Factores de emisión'!J105","v":"R-426A"},"R-134a/125/600/601a (93/5,1/1,3/0,6)",{"$f":"'7_Factores de emisión'!O105","v":{"v":1508,"d":"1,508"}}]
[{"$nulls":3},{"$f":"'7_Factores de emisión'!K106","v":"R-32/125/143a/134a (15/25/10/50)"},{"$f":"'7_Factores de emisión'!J106","v":"R-427A"},"R-32/125/143a/134a (15/25/10/50)",{"$f":"'7_Factores de emisión'!O106","v":{"v":2138,"d":"2,138"}}]
[{"$nulls":3},{"$f":"'7_Factores de emisión'!K107","v":"R-125/143a/600a/290 (77,5/20/1,9/06)              "},{"$f":"'7_Factores de emisión'!J107","v":"R-428A"},"R-125/143a/600a/290 (77,5/20/1,9/06)              ",{"$f":"'7_Factores de emisión'!O107","v":{"v":3607,"d":"3,607"}}]
[{"$nulls":3},{"$f":"'7_Factores de emisión'!K108","v":"R-125/143a/134a/600a (63,2/18/16/2,8)"},{"$f":"'7_Factores de emisión'!J108","v":"R-434A"},"R-125/143a/134a/600a (63,2/18/16/2,8)",{"$f":"'7_Factores de emisión'!O108","v":{"v":3245,"d":"3,245"}}]
[{"$nulls":3},{"$f":"'7_Factores de emisión'!K109","v":"R-125/134a/600/601 (19,5/78,5/1,4/06)"},{"$f":"'7_Factores de emisión'!J109","v":"R-437A"},"R-125/134a/600/601 (19,5/78,5/1,4/06)",{"$f":"'7_Factores de emisión'!O109","v":{"v":1805,"d":"1,805"}}]
[{"$nulls":3},{"$f":"'7_Factores de emisión'!K110","v":"R-32/125/134a/600/601a (8,5/45/44,2/1,7/0,6)"},{"$f":"'7_Factores de emisión'!J110","v":"R-438A"},"R-32/125/134a/600/601a (8,5/45/44,2/1,7/0,6)",{"$f":"'7_Factores de emisión'!O110","v":{"v":2264,"d":"2,264"}}]
[{"$nulls":3},{"$f":"'7_Factores de emisión'!K111","v":"R-32/125/134a/152a/227ea (31/31/30/3/5)"},{"$f":"'7_Factores de emisión'!J111","v":"R-442A"},{"$f":"D176","v":"R-32/125/134a/152a/227ea (31/31/30/3/5)"},{"$f":"'7_Factores de emisión'!O111","v":{"v":1888,"d":"1,888"}}]
[{"$nulls":3},{"$f":"'7_Factores de emisión'!K112","v":"R-32/R-125/HFO-1234yf/R-134a (24,3/24,7/25,3/25,7)"},{"$f":"'7_Factores de emisión'!J112","v":"R-449A"},"R-32/R-125/HFO-1234yf/R-134a (24,3/24,7/25,3/25,7)",{"$f":"'7_Factores de emisión'!O112","v":{"v":1396,"d":"1,396"}}]
[{"$nulls":3},{"$f":"'7_Factores de emisión'!K113","v":"R-125/R-32/HFO-1234yf (59/11/30)"},{"$f":"'7_Factores de emisión'!J113","v":"R-452A"},"R-125/R-32/HFO-1234yf (59/11/30)",{"$f":"'7_Factores de emisión'!O113","v":{"v":2140,"d":"2,140"}}]
[{"$nulls":3},{"$f":"'7_Factores de emisión'!K114","v":"R-134a/125/32/227ea/600/601a (53,8/20/20/5/0,6/0,6)"},{"$f":"'7_Factores de emisión'!J114","v":"R-453A"},"R-134a/125/32/227ea/600/601a (53,8/20/20/5/0,6/0,6)",{"$f":"'7_Factores de emisión'!O114","v":{"v":1765,"d":"1,765"}}]
[{"$nulls":3},{"$f":"'7_Factores de emisión'!K115","v":"R-125/143a (50/50)"},{"$f":"'7_Factores de emisión'!J115","v":"R-507A"},{"$f":"D180","v":"R-125/143a (50/50)"},{"$f":"'7_Factores de emisión'!O115","v":{"v":3985,"d":"3,985"}}]
[{"$nulls":3},{"$f":"'7_Factores de emisión'!E111","v":"Otros"},"Otros","-",{"$f":"'7_Factores de emisión'!G111","v":"-"}]
[{"$nulls":8},"GdO otros/varias",1]
["4_Electricidad",{"$nulls":7},"GdO genérico",2]
[null,"EDIFICIOS"]
[null,null,"Comercializadora escogida","Fórmula FE","Fórmula Emisiones",null,null,"Listado","Comercializadoras2010","Mix 2010","Comercializadoras2011","Mix 2011","Comercializadoras2012","Mix 2012","Comercializadoras2013","Mix 2013","Comercializadoras2014","Mix 2014","Comercializadoras2015","Mix 2015","Comercializadoras2016","Mix 2016","Comercializadoras2017","Mix 2017","Comercializadoras2018","Mix 2018","Comercializadoras2019","Mix 2019",null,"Fórmula Comercializadoras por año","Fórmula Mix Comercializadoras por año",null,"Resultado electricidad"]
[null,null,{"$f":"'4_Electricidad'!F20","v":0},{"$f":"VLOOKUP(C186,$AD$186:$AE$385,2,0)","v":{"$error":"#N/A"}},{"$f":"IF(ISNUMBER('4_Electricidad'!H20),('4_Electricidad'!H20*'4_Electricidad'!I20),\"\")","v":""},{"$f":"IF(OR(C186=\"Varias comercializadoras\",C186=\"Otras\"),\"otros\",\"genérico\")","v":"genérico"},{"$f":"IF(F186=\"otros\",1,2)","v":2},"Sí ","ACCIONA GREEN ENERGY DEVELOPMENTS, S.L.",{"$f":"'7_Factores de emisión'!N126","v":{"v":0,"d":"0.00"}},{"$f":"'7_Factores de emisión'!E151","v":"ACCIONA GREEN ENERGY DEVELOPMENTS, S.L."},{"$f":"'7_Factores de emisión'!H151","v":{"v":0,"d":"0.00"}},{"$f":"'7_Factores de emisión'!J151","v":"ACCIONA GREEN ENERGY DEVELOPMENTS, S.L."},{"$f":"'7_Factores de emisión'!N151","v":{"v":0,"d":"0.00"}},{"$f":"'7_Factores de emisión'!E183","v":"ACCIONA GREEN ENERGY DEVELOPMENTS, S.L."},{"$f":"'7_Factores de emisión'!H183","v":{"v":0,"d":"0.00"}},{"$f":"'7_Factores de emisión'!J183","v":"ACCIONA GREEN ENERGY DEVELOPMENTS, S.L."},{"$f":"'7_Factores de emisión'!N183","v":{"v":0,"d":"0.00"}},{"$f":"'7_Factores de emisión'!E231","v":"ACCIONA GREEN ENERGY DEVELOPMENTS, S.L."},{"$f":"'7_Factores de emisión'!H231","v":{"v":0,"d":"0.00"}},{"$f":"'7_Factores de emisión'!J231","v":"ACCIONA GREEN ENERGY DEVELOPMENTS, S.L."},{"$f":"'7_Factores de emisión'!N231","v":{"v":0,"d":"0.00"}},{"$f":"'7_Factores de emisión'!E355","v":"A-DOS ENERGíA, S.L. "},{"$f":"'7_Factores de emisión'!H355","v":{"v":0.3400000035762787,"d":"0.34"}},{"$f":"'7_Factores de emisión'!J355","v":"24-7 UTILITIES, S.L.U."},{"$f":"'7_Factores de emisión'!N355","v":{"v":0,"d":"0.00"}},{"$f":"'7_Factores de emisión'!E534","v":"ACCIÓN ENERGÍA COMERCIALIZADORA, S.L."},{"$f":"'7_Factores de emisión'!H534","v":{"v":0,"d":"0.00"}},null,{"$f":"INDIRECT(\"_Com\"&$F$2)","v":{"$error":"#REF!"}},{"$f":"INDIRECT(\"_Mix\"&$F$2)","v":{"$error":"#REF!"}},null,{"$f":"SUM(E208+E231)","v":{"v":0,"d":"0.00"}}]
[null,null,{"$f":"'4_Electricidad'!F21","v":0},{"$f":"VLOOKUP(C187,$AD$186:$AE$385,2,0)","v":{"$error":"#N/A"}},{"$f":"IF(ISNUMBER('4_Electricidad'!H21),('4_Electricidad'!H21*'4_Electricidad'!I21),\"\")","v":""},{"$f":"IF(OR(C187=\"Varias comercializadoras\",C187=\"Otras\"),\"otros\",\"genérico\")","v":"genérico"},{"$f":"IF(F187=\"otros\",1,2)","v":2},"No","DERIVADOS ENERGÉTICOS PARA EL TRANSPORTE Y LA INDUSTRIA, S.A. (DETISA)",{"$f":"'7_Factores de emisión'!N127","v":0.33},{"$f":"'7_Factores de emisión'!E152","v":"AE3000 AGENT COMERCIALITZADOR, S.L."},{"$f":"'7_Factores de emisión'!H152","v":0.36},{"$f":"'7_Factores de emisión'!J152","v":"ALPIQ ENERGÍA ESPAÑA, S.A.U."},{"$f":"'7_Factores de emisión'!N152","v":{"v":0.38999998569488525,"d":"0.39"}},{"$f":"'7_Factores de emisión'!E184","v":"ALPIQ ENERGÍA ESPAÑA, S.A.U."},{"$f":"'7_Factores de emisión'!H184","v":0.25},{"$f":"'7_Factores de emisión'!J184","v":"AGENTE DEL MERCADO ELÉCTRICO, S.A."},{"$f":"'7_Factores de emisión'!N184","v":{"v":0.3700000047683716,"d":"0.37"}},{"$f":"'7_Factores de emisión'!E232","v":"ALDRO ENERGÍA Y SOLUCIONES, S.L.U."},{"$f":"'7_Factores de emisión'!H232","v":{"v":0.4000000059604645,"d":"0.40"}},{"$f":"'7_Factores de emisión'!J232","v":"ACCIÓN ENERGÍA COMERCIALIZADORA, S.L."},{"$f":"'7_Factores de emisión'!N232","v":{"v":0,"d":"0.00"}},{"$f":"'7_Factores de emisión'!E356","v":"ACCIONA GREEN ENERGY DEVELOPMENTS, S.L."},{"$f":"'7_Factores de emisión'!H356","v":{"v":0,"d":"0.00"}},{"$f":"'7_Factores de emisión'!J356","v":"ACCIONA GREEN ENERGY DEVELOPMENTS, S.L."},{"$f":"'7_Factores de emisión'!N356","v":{"v":0,"d":"0.00"}},{"$f":"'7_Factores de emisión'!E535","v":"ACCIONA GREEN ENERGY DEVELOPMENTS, S.L."},{"$f":"'7_Factores de emisión'!H535","v":{"v":0,"d":"0.00"}},null,{"$f":"INDIRECT(\"_Com\"&$F$2)","v":{"$error":"#REF!"}},{"$f":"INDIRECT(\"_Mix\"&$F$2)","v":{"$error":"#REF!"}}]
[null,null,{"$f":"'4_Electricidad'!F22","v":0},{"$error":"#N/A"},{"$f":"IF(ISNUMBER('4_Electricidad'!H22),('4_Electricidad'!H22*'4_Electricidad'!I22),\"\")","v":""},"genérico",2,null,"E.ON ENERGIA, S.L.",{"$f":"'7_Factores de emisión'!N128","v":0.13},{"$f":"'7_Factores de emisión'!E153","v":"ALPIQ ENERGÍA ESPAÑA, S.A.U."},{"$f":"'7_Factores de emisión'!H153","v":0.35},{"$f":"'7_Factores de emisión'!J153","v":"COMERCIALIZADORA LERSA , S.L."},{"$f":"'7_Factores de emisión'!N153","v":{"v":0.4000000059604645,"d":"0.40"}},{"$f":"'7_Factores de emisión'!E185","v":"AXPO IBERIA, S.L."},{"$f":"'7_Factores de emisión'!H185","v":{"v":0.029999999329447746,"d":"0.03"}},{"$f":"'7_Factores de emisión'!J185","v":"AURA ENERGÍA, S.L."},{"$f":"'7_Factores de emisión'!N185","v":{"v":0.28999999165534973,"d":"0.29"}},{"$f":"'7_Factores de emisión'!E233","v":"ANOTHER ENERGY OPTION, S.L."},{"$f":"'7_Factores de emisión'!H233","v":{"v":0,"d":"0.00"}},{"$f":"'7_Factores de emisión'!J233","v":"ADEINNOVA ENERGÍA, S.L.U."},{"$f":"'7_Factores de emisión'!N233","v":{"v":0.33000001311302185,"d":"0.33"}},{"$f":"'7_Factores de emisión'!E357","v":"ACCIÓN ENERGÍA COMERCIALIZADORA, S.L."},{"$f":"'7_Factores de emisión'!H357","v":{"v":0.07000000029802322,"d":"0.07"}},{"$f":"'7_Factores de emisión'!J357","v":"ACCIÓN ENERGÍA COMERCIALIZADORA, S.L."},{"$f":"'7_Factores de emisión'!N357","v":{"v":0,"d":"0.00"}},{"$f":"'7_Factores de emisión'!E536","v":"ACSOL ENERGÍA GLOBAL, S.A."},{"$f":"'7_Factores de emisión'!H536","v":{"v":0.28999999165534973,"d":"0.29"}},null,{"$error":"#REF!"},{"$error":"#REF!"}]
[null,null,{"$f":"'4_Electricidad'!F23","v":0},{"$error":"#N/A"},{"$f":"IF(ISNUMBER('4_Electricidad'!H23),('4_Electricidad'!H23*'4_Electricidad'!I23),\"\")","v":""},{"$f":"IF(OR(C189=\"Varias comercializadoras\",C189=\"Otras\"),\"otros\",\"genérico\")","v":"genérico"},{"$f":"IF(F189=\"otros\",1,2)","v":2},null,"ELEKTRIZITÄTS-GESELLSCHAFT LAUFENBURG ESPAÑA, S.L.",{"$f":"'7_Factores de emisión'!N129","v":{"v":0,"d":"0.00"}},{"$f":"'7_Factores de emisión'!E154","v":"COMERCIALIZADORA LERSA , S.L."},{"$f":"'7_Factores de emisión'!H154","v":0.36},{"$f":"'7_Factores de emisión'!J154","v":"DERIVADOS ENERGÉTICOS PARA EL TRANSPORTE Y LA INDUSTRIA, S.A. (DETISA)"},{"$f":"'7_Factores de emisión'!N154","v":{"v":0.3100000023841858,"d":"0.31"}},{"$f":"'7_Factores de emisión'!E186","v":"CEPSA GAS Y ELECTRICIDAD"},{"$f":"'7_Factores de emisión'!H186","v":{"v":0,"d":"0.00"}},{"$f":"'7_Factores de emisión'!J186","v":"AVANZALIA ENERGÍA COMERCIALIZADORA, S.A."},{"$f":"'7_Factores de emisión'!N186","v":{"v":0,"d":"0.00"}},{"$f":"'7_Factores de emisión'!E234","v":"AUDAX ENERGÍA, S.L.U."},{"$f":"'7_Factores de emisión'!H234","v":{"v":0.4000000059604645,"d":"0.40"}},{"$f":"'7_Factores de emisión'!J234","v":"AGRI-ENERGÍA, S.A."},{"$f":"'7_Factores de emisión'!N234","v":{"v":0,"d":"0.00"}},{"$f":"'7_Factores de emisión'!E358","v":"ACSOL ENERGÍA GLOBAL, S.A."},{"$f":"'7_Factores de emisión'!H358","v":{"v":0.4300000071525574,"d":"0.43"}},{"$f":"'7_Factores de emisión'!J358","v":"ACSOL ENERGÍA GLOBAL, S.A."},{"$f":"'7_Factores de emisión'!N358","v":{"v":0.4099999964237213,"d":"0.41"}},{"$f":"'7_Factores de emisión'!E537","v":"ADEINNOVA ENERGÍA, S.L.U."},{"$f":"'7_Factores de emisión'!H537","v":{"v":0.11999999731779099,"d":"0.12"}},null,{"$error":"#REF!"},{"$error":"#REF!"}]
[null,null,{"$f":"'4_Electricidad'!F24","v":0},{"$error":"#N/A"},{"$f":"IF(ISNUMBER('4_Electricidad'!H24),('4_Electricidad'!H24*'4_Electricidad'!I24),\"\")","v":""},"genérico",2,null,"ENDESA ENERGIA, S.A.",{"$f":"'7_Factores de emisión'!N130","v":0.26},{"$f":"'7_Factores de emisión'!E155","v":"DERIVADOS ENERGÉTICOS PARA EL TRANSPORTE Y LA INDUSTRIA, S.A. (DETISA)"},{"$f":"'7_Factores de emisión'!H155","v":0.16},{"$f":"'7_Factores de emisión'!J155","v":"E.ON ENERGÍA, S.L."},{"$f":"'7_Factores de emisión'!N155","v":{"v":0.30000001192092896,"d":"0.30"}},{"$f":"'7_Factores de emisión'!E187","v":"CLIDOM ENERGY, S.L."},{"$f":"'7_Factores de emisión'!H187","v":{"v":0,"d":"0.00"}},{"$f":"'7_Factores de emisión'!J187","v":"AXPO IBERIA, S.L."},{"$f":"'7_Factores de emisión'!N187","v":{"v":0,"d":"0.00"}},{"$f":"'7_Factores de emisión'!E235","v":"AURA ENERGÍA, S.L."},{"$f":"'7_Factores de emisión'!H235","v":{"v":0,"d":"0.00"}},{"$f":"'7_Factores de emisión'!J235","v":"ALCANZIA ENERGÍA, S.L."},{"$f":"'7_Factores de emisión'!N235","v":{"v":0.30000001192092896,"d":"0.30"}},{"$f":"'7_Factores de emisión'!E359","v":"ADEINNOVA ENERGÍA, S.L.U."},{"$f":"'7_Factores de emisión'!H359","v":{"v":0.38999998569488525,"d":"0.39"}},{"$f":"'7_Factores de emisión'!J359","v":"ADEINNOVA ENERGÍA, S.L.U."},{"$f":"'7_Factores de emisión'!N359","v":{"v":0.3100000023841858,"d":"0.31"}},{"$f":"'7_Factores de emisión'!E538","v":"ADELFAS ENERGÍA, S.L."},{"$f":"'7_Factores de emisión'!H538","v":{"v":0.03999999910593033,"d":"0.04"}},null,{"$error":"#REF!"},{"$error":"#REF!"}]
[null,null,{"$f":"'4_Electricidad'!F25","v":0},{"$error":"#N/A"},{"$f":"IF(ISNUMBER('4_Electricidad'!H25),('4_Electricidad'!H25*'4_Electricidad'!I25),\"\")","v":""},"genérico",2,null,"ENÉRGYA VM GESTIÓN DE ENERGÍA, S.L.U.",{"$f":"'7_Factores de emisión'!N131","v":{"v":0,"d":"0.00"}},{"$f":"'7_Factores de emisión'!E156","v":"E.ON ENERGÍA, S.L."},{"$f":"'7_Factores de emisión'!H156","v":0.21},{"$f":"'7_Factores de emisión'!J156","v":"EGL ENERGÍA IBERIA, S.L."},{"$f":"'7_Factores de emisión'!N156","v":{"v":0,"d":"0.00"}},{"$f":"'7_Factores de emisión'!E188","v":"COMERCIALIZADORA LERSA , S.L."},{"$f":"'7_Factores de emisión'!H188","v":{"v":0.3499999940395355,"d":"0.35"}},{"$f":"'7_Factores de emisión'!J188","v":"CEPSA GAS Y ELECTRICIDAD, S.A."},{"$f":"'7_Factores de emisión'!N188","v":{"v":0,"d":"0.00"}},{"$f":"'7_Factores de emisión'!E236","v":"AVANZALIA ENERGÍA COMERCIALIZADORA, S.A."},{"$f":"'7_Factores de emisión'!H236","v":0.25},{"$f":"'7_Factores de emisión'!J236","v":"ALDRO ENERGÍA Y SOLUCIONES, S.L.U."},{"$f":"'7_Factores de emisión'!N236","v":{"v":0.36000001430511475,"d":"0.36"}},{"$f":"'7_Factores de emisión'!E360","v":"AGENTE DEL MERCADO ELÉCTRICO, S.A."},{"$f":"'7_Factores de emisión'!H360","v":{"v":0.41999998688697815,"d":"0.42"}},{"$f":"'7_Factores de emisión'!J360","v":"ADELFAS ENERGÍA, S.L."},{"$f":"'7_Factores de emisión'!N360","v":{"v":0.3499999940395355,"d":"0.35"}},{"$f":"'7_Factores de emisión'!E539","v":"ADS ENERGY 8,0, S.L."},{"$f":"'7_Factores de emisión'!H539","v":{"v":0,"d":"0.00"}},null,{"$error":"#REF!"},{"$error":"#REF!"}]
[null,null,{"$f":"'4_Electricidad'!F26","v":0},{"$error":"#N/A"},{"$f":"IF(ISNUMBER('4_Electricidad'!H26),('4_Electricidad'!H26*'4_Electricidad'!I26),\"\")","v":""},"genérico",2,null,"FACTOR ENERGIA, S.A",{"$f":"'7_Factores de emisión'!N132","v":0.21},{"$f":"'7_Factores de emisión'!E157","v":"EGL ENERGÍA IBERIA, S.L."},{"$f":"'7_Factores de emisión'!H157","v":{"v":0,"d":"0.00"}},{"$f":"'7_Factores de emisión'!J157","v":"ENARA GESTIÓN Y MEDIACIÓN, S.L."},{"$f":"'7_Factores de emisión'!N157","v":{"v":0,"d":"0.00"}},{"$f":"'7_Factores de emisión'!E189","v":"E.ON ENERGÍA, S.L."},{"$f":"'7_Factores de emisión'!H189","v":0.25},{"$f":"'7_Factores de emisión'!J189","v":"CIDE HCENERGÍA S.A."},{"$f":"'7_Factores de emisión'!N189","v":{"v":0.3700000047683716,"d":"0.37"}},{"$f":"'7_Factores de emisión'!E237","v":"AXPO IBERIA, S.L."},{"$f":"'7_Factores de emisión'!H237","v":{"v":0,"d":"0.00"}},{"$f":"'7_Factores de emisión'!J237","v":"ANOTHER ENERGY OPTION, S.L."},{"$f":"'7_Factores de emisión'!N237","v":{"v":0,"d":"0.00"}},{"$f":"'7_Factores de emisión'!E361","v":"AGRI-ENERGÍA, S.A."},{"$f":"'7_Factores de emisión'!H361","v":{"v":0,"d":"0.00"}},{"$f":"'7_Factores de emisión'!J361","v":"AGENTE DEL MERCADO ELÉCTRICO, S.A."},{"$f":"'7_Factores de emisión'!N361","v":{"v":0.36000001430511475,"d":"0.36"}},{"$f":"'7_Factores de emisión'!E540","v":"ADURIZ ENERGÍA, S.L.U."},{"$f":"'7_Factores de emisión'!H540","v":{"v":0,"d":"0.00"}},null,{"$error":"#REF!"},{"$error":"#REF!"}]
[null,null,{"$f":"'4_Electricidad'!F27","v":0},{"$error":"#N/A"},{"$f":"IF(ISNUMBER('4_Electricidad'!H27),('4_Electricidad'!H27*'4_Electricidad'!I27),\"\")","v":""},"genérico",2,null,"GAS NATURAL COMERCIALIZADORA, S.A.",{"$f":"'7_Factores de emisión'!N133","v":0.06},{"$f":"'7_Factores de emisión'!E158","v":"ENARA GESTIÓN Y MEDIACIÓN, S.L."},{"$f":"'7_Factores de emisión'!H158","v":0.19},{"$f":"'7_Factores de emisión'!J158","v":"ENDESA ENERGÍA, S.A."},{"$f":"'7_Factores de emisión'!N158","v":{"v":0.3700000047683716,"d":"0.37"}},{"$f":"'7_Factores de emisión'!E190","v":"ELECTRICA SOLLERENSE, S.A."},{"$f":"'7_Factores de emisión'!H190","v":{"v":0,"d":"0.00"}},{"$f":"'7_Factores de emisión'!J190","v":"CLIDOM ENERGY, S.L."},{"$f":"'7_Factores de emisión'!N190","v":{"v":0,"d":"0.00"}},{"$f":"'7_Factores de emisión'!E238","v":"BASSOLS ENERGÍA COMERCIAL, S.L."},{"$f":"'7_Factores de emisión'!H238","v":{"v":0.38999998569488525,"d":"0.39"}},{"$f":"'7_Factores de emisión'!J238","v":"AQUÍ ENERGÍA, S.L."},{"$f":"'7_Factores de emisión'!N238","v":{"v":0,"d":"0.00"}},{"$f":"'7_Factores de emisión'!E362","v":"ALCANZIA ENERGÍA, S.L."},{"$f":"'7_Factores de emisión'!H362","v":{"v":0.3199999928474426,"d":"0.32"}},{"$f":"'7_Factores de emisión'!J362","v":"AGRI-ENERGÍA, S.A."},{"$f":"'7_Factores de emisión'!N362","v":{"v":0,"d":"0.00"}},{"$f":"'7_Factores de emisión'!E541","v":"AGENTE DEL MERCADO ELÉCTRICO, S.A."},{"$f":"'7_Factores de emisión'!H541","v":{"v":0.27000001072883606,"d":"0.27"}},null,{"$error":"#REF!"},{"$error":"#REF!"}]
[null,null,{"$f":"'4_Electricidad'!F28","v":0},{"$error":"#N/A"},{"$f":"IF(ISNUMBER('4_Electricidad'!H28),('4_Electricidad'!H28*'4_Electricidad'!I28),\"\")","v":""},"genérico",2,null,"GAS NATURAL SERVICIOS SDG, S.A.",{"$f":"'7_Factores de emisión'!N134","v":0.05},{"$f":"'7_Factores de emisión'!E159","v":"ENDESA ENERGÍA, S.A."},{"$f":"'7_Factores de emisión'!H159","v":0.33},{"$f":"'7_Factores de emisión'!J159","v":"ENÉRGYA VM GESTIÓN DE ENERGÍA, S.L.U."},{"$f":"'7_Factores de emisión'!N159","v":{"v":0,"d":"0.00"}},{"$f":"'7_Factores de emisión'!E191","v":"ENARA GESTIÓN Y MEDIACIÓN, S.L."},{"$f":"'7_Factores de emisión'!H191","v":{"v":0,"d":"0.00"}},{"$f":"'7_Factores de emisión'!J191","v":"COMERCIALIZADORA LERSA , S.L."},{"$f":"'7_Factores de emisión'!N191","v":{"v":0.36000001430511475,"d":"0.36"}},{"$f":"'7_Factores de emisión'!E239","v":"CEPSA GAS Y ELECTRICIDAD, S.A."},{"$f":"'7_Factores de emisión'!H239","v":{"v":0,"d":"0.00"}},{"$f":"'7_Factores de emisión'!J239","v":"AUDAX ENERGÍA, S.L.U."},{"$f":"'7_Factores de emisión'!N239","v":{"v":0.36000001430511475,"d":"0.36"}},{"$f":"'7_Factores de emisión'!E363","v":"ALDRO ENERGÍA Y SOLUCIONES, S.L.U."},{"$f":"'7_Factores de emisión'!H363","v":{"v":0.41999998688697815,"d":"0.42"}},{"$f":"'7_Factores de emisión'!J363","v":"AGUAS DE BARBASTRO ENERGÍA, S.L."},{"$f":"'7_Factores de emisión'!N363","v":{"v":0.4099999964237213,"d":"0.41"}},{"$f":"'7_Factores de emisión'!E542","v":"AGRI-ENERGÍA, S.A."},{"$f":"'7_Factores de emisión'!H542","v":{"v":0,"d":"0.00"}},null,{"$error":"#REF!"},{"$error":"#REF!"}]
[null,null,{"$f":"'4_Electricidad'!F29","v":0},{"$error":"#N/A"},{"$f":"IF(ISNUMBER('4_Electricidad'!H29),('4_Electricidad'!H29*'4_Electricidad'!I29),\"\")","v":""},"genérico",2,null,"GESTERNOVA, S.A.",{"$f":"'7_Factores de emisión'!N135","v":{"v":0,"d":"0.00"}},{"$f":"'7_Factores de emisión'!E160","v":"ENÉRGYA VM GESTIÓN DE ENERGÍA, S.L.U."},{"$f":"'7_Factores de emisión'!H160","v":{"v":0,"d":"0.00"}},{"$f":"'7_Factores de emisión'!J160","v":"FACTOR ENERGÍA, S.A."},{"$f":"'7_Factores de emisión'!N160","v":0.25},{"$f":"'7_Factores de emisión'!E192","v":"ENDESA ENERGÍA, S.A."},{"$f":"'7_Factores de emisión'!H192","v":{"v":0.3100000023841858,"d":"0.31"}},{"$f":"'7_Factores de emisión'!J192","v":"CYE ENERGÍA, S.L."},{"$f":"'7_Factores de emisión'!N192","v":{"v":0,"d":"0.00"}},{"$f":"'7_Factores de emisión'!E240","v":"CLIDOM ENERGY, S.L."},{"$f":"'7_Factores de emisión'!H240","v":{"v":0,"d":"0.00"}},{"$f":"'7_Factores de emisión'!J240","v":"AURA ENERGÍA, S.L."},{"$f":"'7_Factores de emisión'!N240","v":{"v":0,"d":"0.00"}},{"$f":"'7_Factores de emisión'!E364","v":"ALPIQ ENERGÍA ESPAÑA, S.A.U."},{"$f":"'7_Factores de emisión'!H364","v":{"v":0.05999999865889549,"d":"0.06"}},{"$f":"'7_Factores de emisión'!J364","v":"ALCANZIA ENERGÍA, S.L."},{"$f":"'7_Factores de emisión'!N364","v":{"v":0.30000001192092896,"d":"0.30"}},{"$f":"'7_Factores de emisión'!E543","v":"AGUAS DE BARBASTRO ENERGÍA, S.L."},{"$f":"'7_Factores de emisión'!H543","v":{"v":0.3100000023841858,"d":"0.31"}},null,{"$error":"#REF!"},{"$error":"#REF!"}]
[null,null,{"$f":"'4_Electricidad'!F30","v":0},{"$error":"#N/A"},{"$f":"IF(ISNUMBER('4_Electricidad'!H30),('4_Electricidad'!H30*'4_Electricidad'!I30),\"\")","v":""},"genérico",2,null,"HIDROCANTABRICO ENERGIA, S.A. UNIPERSONAL",{"$f":"'7_Factores de emisión'!N136","v":0.21},{"$f":"'7_Factores de emisión'!E161","v":"FACTOR ENERGÍA, S.A"},{"$f":"'7_Factores de emisión'!H161","v":0.23},{"$f":"'7_Factores de emisión'!J161","v":"GAS NATURAL COMERCIALIZADORA, S.A."},{"$f":"'7_Factores de emisión'!N161","v":{"v":0.14000000059604645,"d":"0.14"}},{"$f":"'7_Factores de emisión'!E193","v":"ENDESA GENERACIÓN, S.A."},{"$f":"'7_Factores de emisión'!H193","v":{"v":0.2800000011920929,"d":"0.28"}},{"$f":"'7_Factores de emisión'!J193","v":"E.ON ENERGÍA, S.L."},{"$f":"'7_Factores de emisión'!N193","v":{"v":0.27000001072883606,"d":"0.27"}},{"$f":"'7_Factores de emisión'!E241","v":"COMERCIALIZADORA LERSA , S.L."},{"$f":"'7_Factores de emisión'!H241","v":{"v":0.4000000059604645,"d":"0.40"}},{"$f":"'7_Factores de emisión'!J241","v":"AVANZALIA ENERGÍA COMERCIALIZADORA, S.A."},{"$f":"'7_Factores de emisión'!N241","v":{"v":0.15000000596046448,"d":"0.15"}},{"$f":"'7_Factores de emisión'!E365","v":"ANOTHER ENERGY OPTION, S.L."},{"$f":"'7_Factores de emisión'!H365","v":{"v":0.019999999552965164,"d":"0.02"}},{"$f":"'7_Factores de emisión'!J365","v":"ALDRO ENERGÍA Y SOLUCIONES, S.L.U."},{"$f":"'7_Factores de emisión'!N365","v":{"v":0.4000000059604645,"d":"0.40"}},{"$f":"'7_Factores de emisión'!E544","v":"AHORRELUZ SERVICIOS ONLINE S.L"},{"$f":"'7_Factores de emisión'!H544","v":{"v":0,"d":"0.00"}},null,{"$error":"#REF!"},{"$error":"#REF!"}]
[null,null,{"$f":"'4_Electricidad'!F31","v":0},{"$error":"#N/A"},{"$f":"IF(ISNUMBER('4_Electricidad'!H31),('4_Electricidad'!H31*'4_Electricidad'!I31),\"\")","v":""},"genérico",2,null,"HIDROELÉCTRICA EL CARMEN ENERGÍA, S.L.",{"$f":"'7_Factores de emisión'!N137","v":0.28},{"$f":"'7_Factores de emisión'!E162","v":"GAS NATURAL COMERCIALIZADORA, S.A."},{"$f":"'7_Factores de emisión'!H162","v":0.08},{"$f":"'7_Factores de emisión'!J162","v":"GAS NATURAL SERVICIOS SDG, S.A."},{"$f":"'7_Factores de emisión'!N162","v":{"v":0.12999999523162842,"d":"0.13"}},{"$f":"'7_Factores de emisión'!E194","v":"ENERCOLUZ ENERGÍA, S.L."},{"$f":"'7_Factores de emisión'!H194","v":{"v":0.36000001430511475,"d":"0.36"}},{"$f":"'7_Factores de emisión'!J194","v":"ELECTRICA SOLLERENSE, S.A."},{"$f":"'7_Factores de emisión'!N194","v":{"v":0.25999999046325684,"d":"0.26"}},{"$f":"'7_Factores de emisión'!E242","v":"COMERCIALIZADORA ZERO ELECTRUM, S.L."},{"$f":"'7_Factores de emisión'!H242","v":{"v":0.4000000059604645,"d":"0.40"}},{"$f":"'7_Factores de emisión'!J242","v":"AXPO IBERIA, S.L."},{"$f":"'7_Factores de emisión'!N242","v":{"v":0,"d":"0.00"}},{"$f":"'7_Factores de emisión'!E366","v":"APELES ELECTRICIDAD, S.L."},{"$f":"'7_Factores de emisión'!H366","v":{"v":0,"d":"0.00"}},{"$f":"'7_Factores de emisión'!J366","v":"ALILUZ MEDITERRANEA, S.L."},{"$f":"'7_Factores de emisión'!N366","v":{"v":0,"d":"0.00"}},{"$f":"'7_Factores de emisión'!E545","v":"AHORRO ENERGÍA HOGAR INVESTMENTS, S.L."},{"$f":"'7_Factores de emisión'!H545","v":{"v":0.3100000023841858,"d":"0.31"}},null,{"$error":"#REF!"},{"$error":"#REF!"}]
[null,null,{"$f":"'4_Electricidad'!F32","v":0},{"$error":"#N/A"},{"$f":"IF(ISNUMBER('4_Electricidad'!H32),('4_Electricidad'!H32*'4_Electricidad'!I32),\"\")","v":""},"genérico",2,null,"HISPAELEC ENERGIA, S.A",{"$f":"'7_Factores de emisión'!N138","v":{"v":0,"d":"0.00"}},{"$f":"'7_Factores de emisión'!E163","v":"GAS NATURAL SERVICIOS SDG, S.A."},{"$f":"'7_Factores de emisión'!H163","v":0.08},{"$f":"'7_Factores de emisión'!J163","v":"GDF SUEZ ESPAÑA, S.A.U."},{"$f":"'7_Factores de emisión'!N163","v":{"v":0.009999999776482582,"d":"0.01"}},{"$f":"'7_Factores de emisión'!E195","v":"ENERGY BY COGEN, S.L."},{"$f":"'7_Factores de emisión'!H195","v":{"v":0.3199999928474426,"d":"0.32"}},{"$f":"'7_Factores de emisión'!J195","v":"ENARA GESTIÓN Y MEDIACIÓN, S.L."},{"$f":"'7_Factores de emisión'!N195","v":{"v":0,"d":"0.00"}},{"$f":"'7_Factores de emisión'!E243","v":"COMPAÑÍA ESCANDINAVA DE ELECTRICIDAD EN ESPAÑA, S.L."},{"$f":"'7_Factores de emisión'!H243","v":{"v":0,"d":"0.00"}},{"$f":"'7_Factores de emisión'!J243","v":"BASSOLS ENERGÍA COMERCIAL, S.L."},{"$f":"'7_Factores de emisión'!N243","v":{"v":0,"d":"0.00"}},{"$f":"'7_Factores de emisión'!E367","v":"AQUÍ ENERGÍA, S.L."},{"$f":"'7_Factores de emisión'!H367","v":{"v":0,"d":"0.00"}},{"$f":"'7_Factores de emisión'!J367","v":"ALPIQ ENERGÍA ESPAÑA, S.A.U."},{"$f":"'7_Factores de emisión'!N367","v":{"v":0.11999999731779099,"d":"0.12"}},{"$f":"'7_Factores de emisión'!E546","v":"ALCANZIA ENERGÍA, S.L."},{"$f":"'7_Factores de emisión'!H546","v":{"v":0,"d":"0.00"}},null,{"$error":"#REF!"},{"$error":"#REF!"}]
[null,null,{"$f":"'4_Electricidad'!F33","v":0},{"$error":"#N/A"},{"$f":"IF(ISNUMBER('4_Electricidad'!H33),('4_Electricidad'!H33*'4_Electricidad'!I33),\"\")","v":""},"genérico",2,null,"IBERDROLA GENERACION, S.A.U.",{"$f":"'7_Factores de emisión'!N139","v":{"v":0.1,"d":"0.10"}},{"$f":"'7_Factores de emisión'!E164","v":"GDF SUEZ ESPAÑA, S.A.U."},{"$f":"'7_Factores de emisión'!H164","v":{"v":0,"d":"0.00"}},{"$f":"'7_Factores de emisión'!J164","v":"GEOATLANTER, S.L."},{"$f":"'7_Factores de emisión'!N164","v":{"v":0,"d":"0.00"}},{"$f":"'7_Factores de emisión'!E196","v":"ENÉRGYA VM GESTIÓN DE ENERGÍA, S.L.U."},{"$f":"'7_Factores de emisión'!H196","v":{"v":0,"d":"0.00"}},{"$f":"'7_Factores de emisión'!J196","v":"ENDESA ENERGÍA, S.A."},{"$f":"'7_Factores de emisión'!N196","v":{"v":0.33000001311302185,"d":"0.33"}},{"$f":"'7_Factores de emisión'!E244","v":"COOPERATIVA ELECTRICA DE CASTELLAR, S.C.V."},{"$f":"'7_Factores de emisión'!H244","v":{"v":0,"d":"0.00"}},{"$f":"'7_Factores de emisión'!J244","v":"BETA RENOWABLE GROUP, S.A."},{"$f":"'7_Factores de emisión'!N244","v":{"v":0,"d":"0.00"}},{"$f":"'7_Factores de emisión'!E368","v":"ASAL DE ENERGÍA, S.L. "},{"$f":"'7_Factores de emisión'!H368","v":{"v":0,"d":"0.00"}},{"$f":"'7_Factores de emisión'!J368","v":"ANOTHER ENERGY OPTION, S.L."},{"$f":"'7_Factores de emisión'!N368","v":{"v":0.3499999940395355,"d":"0.35"}},{"$f":"'7_Factores de emisión'!E547","v":"ALDRO ENERGÍA Y SOLUCIONES, S.L.U."},{"$f":"'7_Factores de emisión'!H547","v":{"v":0.30000001192092896,"d":"0.30"}},null,{"$error":"#REF!"},{"$error":"#REF!"}]
[null,null,{"$f":"'4_Electricidad'!F34","v":0},{"$error":"#N/A"},{"$f":"IF(ISNUMBER('4_Electricidad'!H34),('4_Electricidad'!H34*'4_Electricidad'!I34),\"\")","v":""},"genérico",2,null,"NATURGAS COMERCIALIZADORA, S.A.",{"$f":"'7_Factores de emisión'!N140","v":0.23},{"$f":"'7_Factores de emisión'!E165","v":"GESTERNOVA, S.A."},{"$f":"'7_Factores de emisión'!H165","v":{"v":0,"d":"0.00"}},{"$f":"'7_Factores de emisión'!J165","v":"GESTERNOVA, S.A."},{"$f":"'7_Factores de emisión'!N165","v":{"v":0,"d":"0.00"}},{"$f":"'7_Factores de emisión'!E197","v":"FACTOR ENERGÍA, S.A."},{"$f":"'7_Factores de emisión'!H197","v":{"v":0.23999999463558197,"d":"0.24"}},{"$f":"'7_Factores de emisión'!J197","v":"ENDESA GENERACIÓN, S.A."},{"$f":"'7_Factores de emisión'!N197","v":{"v":0,"d":"0.00"}},{"$f":"'7_Factores de emisión'!E245","v":"CYE ENERGÍA, S.L."},{"$f":"'7_Factores de emisión'!H245","v":{"v":0.029999999329447746,"d":"0.03"}},{"$f":"'7_Factores de emisión'!J245","v":"CEMOI ELECTRICITE, S.L. "},{"$f":"'7_Factores de emisión'!N245","v":{"v":0.18000000715255737,"d":"0.18"}},{"$f":"'7_Factores de emisión'!E369","v":"AUDAX ENERGÍA, S.L.U."},{"$f":"'7_Factores de emisión'!H369","v":{"v":0.4099999964237213,"d":"0.41"}},{"$f":"'7_Factores de emisión'!J369","v":"AQUÍ ENERGÍA, S.L."},{"$f":"'7_Factores de emisión'!N369","v":{"v":0,"d":"0.00"}},{"$f":"'7_Factores de emisión'!E548","v":"ALPEX IBERICA DE ENERGÍA, S.L.U"},{"$f":"'7_Factores de emisión'!H548","v":{"v":0,"d":"0.00"}},null,{"$error":"#REF!"},{"$error":"#REF!"}]
[null,null,{"$f":"'4_Electricidad'!F35","v":0},{"$error":"#N/A"},{"$f":"IF(ISNUMBER('4_Electricidad'!H35),('4_Electricidad'!H35*'4_Electricidad'!I35),\"\")","v":""},"genérico",2,null,"NEXUS ENERGIA, S.A.",{"$f":"'7_Factores de emisión'!N141","v":0.28},{"$f":"'7_Factores de emisión'!E166","v":"HIDROCANTABRICO ENERGÍA, S.A. UNIPERSONAL"},{"$f":"'7_Factores de emisión'!H166","v":0.23},{"$f":"'7_Factores de emisión'!J166","v":"HIDROCANTABRICO ENERGÍA, S.A. Unipersonal"},{"$f":"'7_Factores de emisión'!N166","v":{"v":0.23999999463558197,"d":"0.24"}},{"$f":"'7_Factores de emisión'!E198","v":"FENIE ENERGÍA, S.A."},{"$f":"'7_Factores de emisión'!H198","v":{"v":0.3499999940395355,"d":"0.35"}},{"$f":"'7_Factores de emisión'!J198","v":"ENEL GREEN POWER ESPAÑA, S.L."},{"$f":"'7_Factores de emisión'!N198","v":{"v":0,"d":"0.00"}},{"$f":"'7_Factores de emisión'!E246","v":"DREUE ELECTRIC, S.L."},{"$f":"'7_Factores de emisión'!H246","v":{"v":0.019999999552965164,"d":"0.02"}},{"$f":"'7_Factores de emisión'!J246","v":"CEPSA GAS Y ELECTRICIDAD, S.A."},{"$f":"'7_Factores de emisión'!N246","v":{"v":0,"d":"0.00"}},{"$f":"'7_Factores de emisión'!E370","v":"AURA ENERGÍA, S.L."},{"$f":"'7_Factores de emisión'!H370","v":{"v":0,"d":"0.00"}},{"$f":"'7_Factores de emisión'!J370","v":"ASAL DE ENERGÍA, S.L. "},{"$f":"'7_Factores de emisión'!N370","v":{"v":0,"d":"0.00"}},{"$f":"'7_Factores de emisión'!E549","v":"ALPIQ ENERGÍA ESPAÑA, S.A.U."},{"$f":"'7_Factores de emisión'!H549","v":{"v":0.18000000715255737,"d":"0.18"}},null,{"$error":"#REF!"},{"$error":"#REF!"}]
[null,null,{"$f":"'4_Electricidad'!F36","v":0},{"$error":"#N/A"},{"$f":"IF(ISNUMBER('4_Electricidad'!H36),('4_Electricidad'!H36*'4_Electricidad'!I36),\"\")","v":""},"genérico",2,null,"NEXUS RENOVABLES, S.L.",{"$f":"'7_Factores de emisión'!N142","v":{"v":0,"d":"0.00"}},{"$f":"'7_Factores de emisión'!E167","v":"HIDROELÉCTRICA EL CARMEN ENERGÍA, S.L."},{"$f":"'7_Factores de emisión'!H167","v":0.33},{"$f":"'7_Factores de emisión'!J167","v":"HIDROELÉCTRICA EL CARMEN ENERGÍA, S.L."},{"$f":"'7_Factores de emisión'!N167","v":{"v":0,"d":"0.00"}},{"$f":"'7_Factores de emisión'!E199","v":"GAS NATURAL COMERCIALIZADORA, S.A."},{"$f":"'7_Factores de emisión'!H199","v":{"v":0.23000000417232513,"d":"0.23"}},{"$f":"'7_Factores de emisión'!J199","v":"ENERCOLUZ ENERGÍA, S.L."},{"$f":"'7_Factores de emisión'!N199","v":{"v":0.3100000023841858,"d":"0.31"}},{"$f":"'7_Factores de emisión'!E247","v":"E.ON ENERGÍA, S.L."},{"$f":"'7_Factores de emisión'!H247","v":{"v":0.3400000035762787,"d":"0.34"}},{"$f":"'7_Factores de emisión'!J247","v":"CLIDOM ENERGY, S.L."},{"$f":"'7_Factores de emisión'!N247","v":{"v":0,"d":"0.00"}},{"$f":"'7_Factores de emisión'!E371","v":"AUSARTA PRIMA, S.L."},{"$f":"'7_Factores de emisión'!H371","v":{"v":0,"d":"0.00"}},{"$f":"'7_Factores de emisión'!J371","v":"AUDAX ENERGÍA, S.L.U."},{"$f":"'7_Factores de emisión'!N371","v":{"v":0.28999999165534973,"d":"0.29"}},{"$f":"'7_Factores de emisión'!E550","v":"ANOTHER ENERGY OPTION, S.L."},{"$f":"'7_Factores de emisión'!H550","v":{"v":0,"d":"0.00"}},null,{"$error":"#REF!"},{"$error":"#REF!"}]
[null,null,{"$f":"'4_Electricidad'!F37","v":0},{"$error":"#N/A"},{"$f":"IF(ISNUMBER('4_Electricidad'!H37),('4_Electricidad'!H37*'4_Electricidad'!I37),\"\")","v":""},"genérico",2,null,"UNION FENOSA COMERCIAL, S.L.",{"$f":"'7_Factores de emisión'!N143","v":0.26},{"$f":"'7_Factores de emisión'!E168","v":"IBERDROLA GENERACION, S.A.U."},{"$f":"'7_Factores de emisión'!H168","v":0.17},{"$f":"'7_Factores de emisión'!J168","v":"IBERDROLA GENERACION, S.A.U."},{"$f":"'7_Factores de emisión'!N168","v":{"v":0.23999999463558197,"d":"0.24"}},{"$f":"'7_Factores de emisión'!E200","v":"GAS NATURAL SERVICIOS SDG, S.A."},{"$f":"'7_Factores de emisión'!H200","v":{"v":0.23000000417232513,"d":"0.23"}},{"$f":"'7_Factores de emisión'!J200","v":"ENÉRGYA VM GESTIÓN DE ENERGÍA, S.L.U."},{"$f":"'7_Factores de emisión'!N200","v":{"v":0,"d":"0.00"}},{"$f":"'7_Factores de emisión'!E248","v":"ELECTRICA DE CHERA, S.C.V."},{"$f":"'7_Factores de emisión'!H248","v":{"v":0,"d":"0.00"}},{"$f":"'7_Factores de emisión'!J248","v":"COMERCIALIZADORA ELÉCTRICA DE CADIZ, S.A."},{"$f":"'7_Factores de emisión'!N248","v":{"v":0,"d":"0.00"}},{"$f":"'7_Factores de emisión'!E372","v":"AVANZALIA ENERGÍA COMERCIALIZADORA, S.A."},{"$f":"'7_Factores de emisión'!H372","v":{"v":0.10999999940395355,"d":"0.11"}},{"$f":"'7_Factores de emisión'!J372","v":"AURA ENERGÍA, S.L."},{"$f":"'7_Factores de emisión'!N372","v":{"v":0,"d":"0.00"}},{"$f":"'7_Factores de emisión'!E551","v":"AQUÍ ENERGÍA, S.L."},{"$f":"'7_Factores de emisión'!H551","v":{"v":0,"d":"0.00"}},null,{"$error":"#REF!"},{"$error":"#REF!"}]
[null,null,{"$f":"'4_Electricidad'!F38","v":0},{"$error":"#N/A"},{"$f":"IF(ISNUMBER('4_Electricidad'!H38),('4_Electricidad'!H38*'4_Electricidad'!I38),\"\")","v":""},"genérico",2,null,"Varias comercializadoras",{"$f":"'7_Factores de emisión'!J123","v":0.31},{"$f":"'7_Factores de emisión'!E169","v":"NATURGAS COMERCIALIZADORA, S.A."},{"$f":"'7_Factores de emisión'!H169","v":0.26},{"$f":"'7_Factores de emisión'!J169","v":"LA UNION ELECTRO INDUSTRIAL, S.L. \"UNIPERSONAL\""},{"$f":"'7_Factores de emisión'!N169","v":{"v":0.3499999940395355,"d":"0.35"}},{"$f":"'7_Factores de emisión'!E201","v":"GDF SUEZ ESPAÑA, S.A.U."},{"$f":"'7_Factores de emisión'!H201","v":{"v":0.3199999928474426,"d":"0.32"}},{"$f":"'7_Factores de emisión'!J201","v":"FACTOR ENERGÍA, S.A."},{"$f":"'7_Factores de emisión'!N201","v":{"v":0.27000001072883606,"d":"0.27"}},{"$f":"'7_Factores de emisión'!E249","v":"ELECTRICA DE GUADASSUAR COOP. V."},{"$f":"'7_Factores de emisión'!H249","v":{"v":0,"d":"0.00"}},{"$f":"'7_Factores de emisión'!J249","v":"COMERCIALIZADORA LERSA , S.L."},{"$f":"'7_Factores de emisión'!N249","v":{"v":0.05000000074505806,"d":"0.05"}},{"$f":"'7_Factores de emisión'!E373","v":"AXPO IBERIA, S.L."},{"$f":"'7_Factores de emisión'!H373","v":{"v":0,"d":"0.00"}},{"$f":"'7_Factores de emisión'!J373","v":"AUSARTA PRIMA, S.L."},{"$f":"'7_Factores de emisión'!N373","v":{"v":0,"d":"0.00"}},{"$f":"'7_Factores de emisión'!E552","v":"ASAL DE ENERGÍA, S.L. "},{"$f":"'7_Factores de emisión'!H552","v":{"v":0,"d":"0.00"}},null,{"$error":"#REF!"},{"$error":"#REF!"}]
[null,null,{"$f":"'4_Electricidad'!F39","v":0},{"$error":"#N/A"},{"$f":"IF(ISNUMBER('4_Electricidad'!H39),('4_Electricidad'!H39*'4_Electricidad'!I39),\"\")","v":""},"genérico",2,null,"Otras",{"$f":"J204","v":0.31},{"$f":"'7_Factores de emisión'!E170","v":"NEXUS ENERGÍA, S.A."},{"$f":"'7_Factores de emisión'!H170","v":0.36},{"$f":"'7_Factores de emisión'!J170","v":"NATURGAS ENERGÍA COMERCIALIZADORA, S.A.U."},{"$f":"'7_Factores de emisión'!N170","v":0.25},{"$f":"'7_Factores de emisión'!E202","v":"GEOATLANTER, S.L."},{"$f":"'7_Factores de emisión'!H202","v":{"v":0,"d":"0.00"}},{"$f":"'7_Factores de emisión'!J202","v":"FENIE ENERGÍA, S.A."},{"$f":"'7_Factores de emisión'!N202","v":{"v":0.3199999928474426,"d":"0.32"}},{"$f":"'7_Factores de emisión'!E250","v":"ELECTRICA SOLLERENSE, S.A."},{"$f":"'7_Factores de emisión'!H250","v":{"v":0.33000001311302185,"d":"0.33"}},{"$f":"'7_Factores de emisión'!J250","v":"COMPAÑÍA ESCANDINAVA DE ELECTRICIDAD EN ESPAÑA, S.L."},{"$f":"'7_Factores de emisión'!N250","v":{"v":0,"d":"0.00"}},{"$f":"'7_Factores de emisión'!E374","v":"BASSOLS ENERGÍA COMERCIAL, S.L."},{"$f":"'7_Factores de emisión'!H374","v":{"v":0,"d":"0.00"}},{"$f":"'7_Factores de emisión'!J374","v":"AVANZALIA ENERGÍA COMERCIALIZADORA, S.A."},{"$f":"'7_Factores de emisión'!N374","v":0.25},{"$f":"'7_Factores de emisión'!E553","v":"ATLAS ENERGÍA COMERCIAL, S.L."},{"$f":"'7_Factores de emisión'!H553","v":{"v":0.2800000011920929,"d":"0.28"}},null,{"$error":"#REF!"},{"$error":"#REF!"}]
[null,null,{"$f":"'4_Electricidad'!F40","v":0},{"$error":"#N/A"},{"$f":"IF(ISNUMBER('4_Electricidad'!H40),('4_Electricidad'!H40*'4_Electricidad'!I40),\"\")","v":""},"genérico",2,{"$nulls":3},{"$f":"'7_Factores de emisión'!E171","v":"NEXUS RENOVABLES, S.L."},{"$f":"'7_Factores de emisión'!H171","v":{"v":0,"d":"0.00"}},{"$f":"'7_Factores de emisión'!J171","v":"NEXUS ENERGÍA, S.A."},{"$f":"'7_Factores de emisión'!N171","v":{"v":0.30000001192092896,"d":"0.30"}},{"$f":"'7_Factores de emisión'!E203","v":"GESTERNOVA, S.A."},{"$f":"'7_Factores de emisión'!H203","v":{"v":0,"d":"0.00"}},{"$f":"'7_Factores de emisión'!J203","v":"GAS NATURAL COMERCIALIZADORA, S.A."},{"$f":"'7_Factores de emisión'!N203","v":{"v":0.28999999165534973,"d":"0.29"}},{"$f":"'7_Factores de emisión'!E251","v":"ELÉCTRICA DE MELIANA, S.C.V."},{"$f":"'7_Factores de emisión'!H251","v":{"v":0,"d":"0.00"}},{"$f":"'7_Factores de emisión'!J251","v":"COMPAÑÍA LUMISA ENERGÍAS, S.L."},{"$f":"'7_Factores de emisión'!N251","v":{"v":0.019999999552965164,"d":"0.02"}},{"$f":"'7_Factores de emisión'!E375","v":"CEPSA GAS Y ELECTRICIDAD, S.A."},{"$f":"'7_Factores de emisión'!H375","v":{"v":0,"d":"0.00"}},{"$f":"'7_Factores de emisión'!J375","v":"AXPO IBERIA, S.L."},{"$f":"'7_Factores de emisión'!N375","v":{"v":0,"d":"0.00"}},{"$f":"'7_Factores de emisión'!E554","v":"AUDAX ENERGÍA, S.L.U."},{"$f":"'7_Factores de emisión'!H554","v":{"v":0,"d":"0.00"}},null,{"$error":"#REF!"},{"$error":"#REF!"}]
[null,null,{"$f":"'4_Electricidad'!F41","v":0},{"$error":"#N/A"},{"$f":"IF(ISNUMBER('4_Electricidad'!H41),('4_Electricidad'!H41*'4_Electricidad'!I41),\"\")","v":""},"genérico",2,{"$nulls":3},{"$f":"'7_Factores de emisión'!E172","v":"SOM ENERGÍA, S.C.C.L."},{"$f":"'7_Factores de emisión'!H172","v":{"v":0,"d":"0.00"}},{"$f":"'7_Factores de emisión'!J172","v":"NEXUS RENOVABLES, S.L."},{"$f":"'7_Factores de emisión'!N172","v":{"v":0.009999999776482582,"d":"0.01"}},{"$f":"'7_Factores de emisión'!E204","v":"GOIENER S.COOP"},{"$f":"'7_Factores de emisión'!H204","v":{"v":0,"d":"0.00"}},{"$f":"'7_Factores de emisión'!J204","v":"GAS NATURAL SERVICIOS SDG, S.A."},{"$f":"'7_Factores de emisión'!N204","v":{"v":0.28999999165534973,"d":"0.29"}},{"$f":"'7_Factores de emisión'!E252","v":"ELÉCTRICA DE SOT DE CHERA S. COOP.V."},{"$f":"'7_Factores de emisión'!H252","v":{"v":0,"d":"0.00"}},{"$f":"'7_Factores de emisión'!J252","v":"COOPERATIVA ELÉCTRICA DE CASTELLAR, S.C.V."},{"$f":"'7_Factores de emisión'!N252","v":{"v":0,"d":"0.00"}},{"$f":"'7_Factores de emisión'!E376","v":"CLIDOM ENERGY, S.L."},{"$f":"'7_Factores de emisión'!H376","v":{"v":0,"d":"0.00"}},{"$f":"'7_Factores de emisión'!J376","v":"BASSOLS ENERGÍA COMERCIAL, S.L."},{"$f":"'7_Factores de emisión'!N376","v":{"v":0,"d":"0.00"}},{"$f":"'7_Factores de emisión'!E555","v":"AURA ENERGÍA, S.L."},{"$f":"'7_Factores de emisión'!H555","v":{"v":0,"d":"0.00"}},null,{"$error":"#REF!"},{"$error":"#REF!"}]
[{"$nulls":4},{"$f":"SUM(E186:E207)","v":{"v":0,"d":"0.00"}},{"$nulls":5},{"$f":"'7_Factores de emisión'!E173","v":"UNION FENOSA COMERCIAL, S.L."},{"$f":"'7_Factores de emisión'!H173","v":0.33},{"$f":"'7_Factores de emisión'!J173","v":"SOM ENERGÍA, S.C.C.L."},{"$f":"'7_Factores de emisión'!N173","v":{"v":0,"d":"0.00"}},{"$f":"'7_Factores de emisión'!E205","v":"HIDROCANTABRICO ENERGÍA, S.A. Unipersonal"},{"$f":"'7_Factores de emisión'!H205","v":{"v":0.17000000178813934,"d":"0.17"}},{"$f":"'7_Factores de emisión'!J205","v":"GDF SUEZ ENERGÍA ESPAÑA, S.A.U."},{"$f":"'7_Factores de emisión'!N205","v":{"v":0.3400000035762787,"d":"0.34"}},{"$f":"'7_Factores de emisión'!E253","v":"ELÉCTRICA DE VINALESA, S.L.U."},{"$f":"'7_Factores de emisión'!H253","v":{"v":0.20999999344348907,"d":"0.21"}},{"$f":"'7_Factores de emisión'!J253","v":"COOPERATIVA ELÉCTRICA BENÉFICA CATRALENSE, COOP. V."},{"$f":"'7_Factores de emisión'!N253","v":{"v":0,"d":"0.00"}},{"$f":"'7_Factores de emisión'!E377","v":"COMERCIALIZADORA ELÉCTRICA DE CÁDIZ, S.A."},{"$f":"'7_Factores de emisión'!H377","v":{"v":0,"d":"0.00"}},{"$f":"'7_Factores de emisión'!J377","v":"CATGAS ENERGÍA, S.A."},{"$f":"'7_Factores de emisión'!N377","v":{"v":0.4000000059604645,"d":"0.40"}},{"$f":"'7_Factores de emisión'!E556","v":"AUSARTA PRIMA, S.L."},{"$f":"'7_Factores de emisión'!H556","v":{"v":0,"d":"0.00"}},null,{"$error":"#REF!"},{"$error":"#REF!"}]
[null,"VEHÍCULOS",{"$nulls":8},"Varias comercializadoras",{"$f":"'7_Factores de emisión'!E148","v":0.36},{"$f":"'7_Factores de emisión'!J174","v":"UNION FENOSA COMERCIAL, S.L."},{"$f":"'7_Factores de emisión'!N174","v":{"v":0.38999998569488525,"d":"0.39"}},{"$f":"'7_Factores de emisión'!E206","v":"HIDROELECTRICA DEL VALIRA, S.L."},{"$f":"'7_Factores de emisión'!H206","v":{"v":0.14000000059604645,"d":"0.14"}},{"$f":"'7_Factores de emisión'!J206","v":"GEOATLANTER, S.L."},{"$f":"'7_Factores de emisión'!N206","v":{"v":0,"d":"0.00"}},{"$f":"'7_Factores de emisión'!E254","v":"EMASP, S. COOP."},{"$f":"'7_Factores de emisión'!H254","v":{"v":0,"d":"0.00"}},{"$f":"'7_Factores de emisión'!J254","v":"COOPERATIVA ELÉCTRICA BENÉFICA SAN FRANCISCO DE ASÍS, COOP. V."},{"$f":"'7_Factores de emisión'!N254","v":{"v":0,"d":"0.00"}},{"$f":"'7_Factores de emisión'!E378","v":"COMERCIALIZADORA ELÉCTRICA TALAYUELAS, S.L."},{"$f":"'7_Factores de emisión'!H378","v":{"v":0,"d":"0.00"}},{"$f":"'7_Factores de emisión'!J378","v":"CEMOI ELECTRICITE, S.L. "},{"$f":"'7_Factores de emisión'!N378","v":{"v":0.3799999952316284,"d":"0.38"}},{"$f":"'7_Factores de emisión'!E557","v":"AVANZALIA ENERGÍA COMERCIALIZADORA, S.A."},{"$f":"'7_Factores de emisión'!H557","v":{"v":0.1899999976158142,"d":"0.19"}},null,{"$error":"#REF!"},{"$error":"#REF!"}]
[null,null,"Comercializadora escogida","Fórmula FE","Fórmula Emisiones",{"$nulls":5},"Otras",{"$f":"L209","v":0.36},{"$f":"'7_Factores de emisión'!J175","v":"ZENCER, S. COOP. AND"},{"$f":"'7_Factores de emisión'!N175","v":{"v":0,"d":"0.00"}},{"$f":"'7_Factores de emisión'!E207","v":"HIDROELÉCTRICA EL CARMEN ENERGÍA, S.L."},{"$f":"'7_Factores de emisión'!H207","v":{"v":0,"d":"0.00"}},{"$f":"'7_Factores de emisión'!J207","v":"GESTERNOVA, S.A."},{"$f":"'7_Factores de emisión'!N207","v":{"v":0,"d":"0.00"}},{"$f":"'7_Factores de emisión'!E255","v":"ENARA GESTIÓN Y MEDIACIÓN, S.L."},{"$f":"'7_Factores de emisión'!H255","v":{"v":0,"d":"0.00"}},{"$f":"'7_Factores de emisión'!J255","v":"COOPERATIVA ELÉCTRICA-BENÉFICA ALBATERENSE, COOP.V."},{"$f":"'7_Factores de emisión'!N255","v":{"v":0,"d":"0.00"}},{"$f":"'7_Factores de emisión'!E379","v":"COMERCIALIZADORA LERSA , S.L."},{"$f":"'7_Factores de emisión'!H379","v":{"v":0,"d":"0.00"}},{"$f":"'7_Factores de emisión'!J379","v":"CEPSA COMERCIAL PETRÓLEO,\r\nS.A.U."},{"$f":"'7_Factores de emisión'!N379","v":{"v":0,"d":"0.00"}},{"$f":"'7_Factores de emisión'!E558","v":"AXPO IBERIA, S.L."},{"$f":"'7_Factores de emisión'!H558","v":{"v":0,"d":"0.00"}},null,{"$error":"#REF!"},{"$error":"#REF!"}]
[null,null,{"$f":"'4_Electricidad'!F49","v":0},{"$f":"VLOOKUP(C211,$AD$186:$AE$385,2,0)","v":{"$error":"#N/A"}},{"$f":"IF(ISNUMBER('4_Electricidad'!H49),('4_Electricidad'!H49*'4_Electricidad'!I49),\"\")","v":""},"genérico",2,{"$nulls":5},"Varias comercializadoras",{"$f":"'7_Factores de emisión'!J148","v":{"v":0.4,"d":"0.40"}},{"$f":"'7_Factores de emisión'!E208","v":"IBERDROLA GENERACION, S.A.U."},{"$f":"'7_Factores de emisión'!H208","v":{"v":0.1599999964237213,"d":"0.16"}},{"$f":"'7_Factores de emisión'!J208","v":"GOIENER S.COOP"},{"$f":"'7_Factores de emisión'!N208","v":{"v":0,"d":"0.00"}},{"$f":"'7_Factores de emisión'!E256","v":"ENDESA ENERGÍA, S.A."},{"$f":"'7_Factores de emisión'!H256","v":{"v":0.3799999952316284,"d":"0.38"}},{"$f":"'7_Factores de emisión'!J256","v":"CYE ENERGÍA, S.L."},{"$f":"'7_Factores de emisión'!N256","v":{"v":0,"d":"0.00"}},{"$f":"'7_Factores de emisión'!E380","v":"COMPAÑÍA ESCANDINAVA DE ELECTRICIDAD EN ESPAÑA, S.L."},{"$f":"'7_Factores de emisión'!H380","v":{"v":0,"d":"0.00"}},{"$f":"'7_Factores de emisión'!J380","v":"CEPSA GAS Y ELECTRICIDAD, S.A."},{"$f":"'7_Factores de emisión'!N380","v":{"v":0,"d":"0.00"}},{"$f":"'7_Factores de emisión'!E559","v":"BASSOLS ENERGÍA COMERCIAL, S.L."},{"$f":"'7_Factores de emisión'!H559","v":{"v":0,"d":"0.00"}},null,{"$error":"#REF!"},{"$error":"#REF!"}]
[null,null,{"$f":"'4_Electricidad'!F50","v":0},{"$error":"#N/A"},{"$f":"IF(ISNUMBER('4_Electricidad'!H50),('4_Electricidad'!H50*'4_Electricidad'!I50),\"\")","v":""},"genérico",2,{"$nulls":5},"Otras",{"$f":"N211","v":{"v":0.4,"d":"0.40"}},{"$f":"'7_Factores de emisión'!E209","v":"LA UNION ELECTRO INDUSTRIAL, S.L. \"UNIPERSONAL\""},{"$f":"'7_Factores de emisión'!H209","v":{"v":0,"d":"0.00"}},{"$f":"'7_Factores de emisión'!J209","v":"HIDROCANTABRICO ENERGÍA, S.A. Unipersonal"},{"$f":"'7_Factores de emisión'!N209","v":{"v":0.1899999976158142,"d":"0.19"}},{"$f":"'7_Factores de emisión'!E257","v":"ENERCOLUZ ENERGÍA, S.L."},{"$f":"'7_Factores de emisión'!H257","v":{"v":0.33000001311302185,"d":"0.33"}},{"$f":"'7_Factores de emisión'!J257","v":"DAIMUZ ENERGÍA, S.L."},{"$f":"'7_Factores de emisión'!N257","v":{"v":0.36000001430511475,"d":"0.36"}},{"$f":"'7_Factores de emisión'!E381","v":"COOPERATIVA ELÉCTRICA DE CASTELLAR, S.C.V."},{"$f":"'7_Factores de emisión'!H381","v":{"v":0,"d":"0.00"}},{"$f":"'7_Factores de emisión'!J381","v":"CHITAHI ENERGY, S.L."},{"$f":"'7_Factores de emisión'!N381","v":{"v":0,"d":"0.00"}},{"$f":"'7_Factores de emisión'!E560","v":"BEYOND SUN SL"},{"$f":"'7_Factores de emisión'!H560","v":{"v":0,"d":"0.00"}},null,{"$error":"#REF!"},{"$error":"#REF!"}]
[null,null,{"$f":"'4_Electricidad'!F51","v":0},{"$error":"#N/A"},{"$f":"IF(ISNUMBER('4_Electricidad'!H51),('4_Electricidad'!H51*'4_Electricidad'!I51),\"\")","v":""},"genérico",2,{"$nulls":7},{"$f":"'7_Factores de emisión'!E210","v":"NATURGAS ENERGÍA COMERCIALIZADORA, S.A.U."},{"$f":"'7_Factores de emisión'!H210","v":{"v":0.20999999344348907,"d":"0.21"}},{"$f":"'7_Factores de emisión'!J210","v":"HIDROELECTRICA DEL VALIRA, S.L."},{"$f":"'7_Factores de emisión'!N210","v":{"v":0.14000000059604645,"d":"0.14"}},{"$f":"'7_Factores de emisión'!E258","v":"ENERGY STROM XXI, S.L."},{"$f":"'7_Factores de emisión'!H258","v":{"v":0.4000000059604645,"d":"0.40"}},{"$f":"'7_Factores de emisión'!J258","v":"DREUE ELECTRIC, S.L."},{"$f":"'7_Factores de emisión'!N258","v":{"v":0,"d":"0.00"}},{"$f":"'7_Factores de emisión'!E382","v":"COOPERATIVA ELÉCTRICA BENÉFICA CATRALENSE, COOP. V."},{"$f":"'7_Factores de emisión'!H382","v":{"v":0,"d":"0.00"}},{"$f":"'7_Factores de emisión'!J382","v":"CLIDOM ENERGY, S.L."},{"$f":"'7_Factores de emisión'!N382","v":{"v":0,"d":"0.00"}},{"$f":"'7_Factores de emisión'!E561","v":"BSG ENERGÍA S.L."},{"$f":"'7_Factores de emisión'!H561","v":{"v":0.28999999165534973,"d":"0.29"}},null,{"$error":"#REF!"},{"$error":"#REF!"}]
[null,null,{"$f":"'4_Electricidad'!F52","v":0},{"$error":"#N/A"},{"$f":"IF(ISNUMBER('4_Electricidad'!H52),('4_Electricidad'!H52*'4_Electricidad'!I52),\"\")","v":""},"genérico",2,{"$nulls":7},{"$f":"'7_Factores de emisión'!E211","v":"NEXUS ENERGÍA, S.A."},{"$f":"'7_Factores de emisión'!H211","v":{"v":0.11999999731779099,"d":"0.12"}},{"$f":"'7_Factores de emisión'!J211","v":"HIDROELÉCTRICA EL CARMEN ENERGÍA, S.L."},{"$f":"'7_Factores de emisión'!N211","v":{"v":0,"d":"0.00"}},{"$f":"'7_Factores de emisión'!E259","v":"ENERGÍA COLECTIVA, S.L."},{"$f":"'7_Factores de emisión'!H259","v":{"v":0,"d":"0.00"}},{"$f":"'7_Factores de emisión'!J259","v":"DRK ENERGY, S.L."},{"$f":"'7_Factores de emisión'!N259","v":{"v":0,"d":"0.00"}},{"$f":"'7_Factores de emisión'!E383","v":"COOPERATIVA ELÉCTRICA BENÉFICA SAN FRANCISCO DE ASÍS, COOP. V."},{"$f":"'7_Factores de emisión'!H383","v":{"v":0,"d":"0.00"}},{"$f":"'7_Factores de emisión'!J383","v":"COMERCIALIZADORA DE ELECTRICIDAD Y GAS DEL MEDITERRÁNEO, S.L."},{"$f":"'7_Factores de emisión'!N383","v":{"v":0,"d":"0.00"}},{"$f":"'7_Factores de emisión'!E562","v":"BULB ENERGÍA IBERICA, S.L."},{"$f":"'7_Factores de emisión'!H562","v":{"v":0,"d":"0.00"}},null,{"$error":"#REF!"},{"$error":"#REF!"}]
[null,null,{"$f":"'4_Electricidad'!F53","v":0},{"$error":"#N/A"},{"$f":"IF(ISNUMBER('4_Electricidad'!H53),('4_Electricidad'!H53*'4_Electricidad'!I53),\"\")","v":""},"genérico",2,{"$nulls":7},{"$f":"'7_Factores de emisión'!E212","v":"NEXUS RENOVABLES, S.L."},{"$f":"'7_Factores de emisión'!H212","v":{"v":0,"d":"0.00"}},{"$f":"'7_Factores de emisión'!J212","v":"IBERDROLA CLIENTES, S.A.U."},{"$f":"'7_Factores de emisión'!N212","v":{"v":0.119999997317791,"d":"0.12"}},{"$f":"'7_Factores de emisión'!E260","v":"ENERPLUS ENERGÍA, S.A."},{"$f":"'7_Factores de emisión'!H260","v":{"v":0.009999999776482582,"d":"0.01"}},{"$f":"'7_Factores de emisión'!J260","v":"EDP COMERCIALIZADORA, S.A.U."},{"$f":"'7_Factores de emisión'!N260","v":{"v":0.23999999463558197,"d":"0.24"}},{"$f":"'7_Factores de emisión'!E384","v":"COOPERATIVA ELÉCTRICA-BENÉFICA ALBATERENSE, COOP.V."},{"$f":"'7_Factores de emisión'!H384","v":{"v":0,"d":"0.00"}},{"$f":"'7_Factores de emisión'!J384","v":"COMERCIALIZADORA DE ENERGÍA DIRECTA, S.L."},{"$f":"'7_Factores de emisión'!N384","v":{"v":0,"d":"0.00"}},{"$f":"'7_Factores de emisión'!E563","v":"CATGAS ENERGÍA, S.A."},{"$f":"'7_Factores de emisión'!H563","v":{"v":0,"d":"0.00"}},null,{"$error":"#REF!"},{"$error":"#REF!"}]
[null,null,{"$f":"'4_Electricidad'!F54","v":0},{"$error":"#N/A"},{"$f":"IF(ISNUMBER('4_Electricidad'!H54),('4_Electricidad'!H54*'4_Electricidad'!I54),\"\")","v":""},"genérico",2,{"$nulls":7},{"$f":"'7_Factores de emisión'!E213","v":"OLTEN-LLUM, S.L."},{"$f":"'7_Factores de emisión'!H213","v":{"v":0.3400000035762787,"d":"0.34"}},{"$f":"'7_Factores de emisión'!J213","v":"LA UNION ELECTRO INDUSTRIAL, S.L. \"UNIPERSONAL\""},{"$f":"'7_Factores de emisión'!N213","v":{"v":0.03999999910593033,"d":"0.04"}},{"$f":"'7_Factores de emisión'!E261","v":"ENÉRGYA VM GESTIÓN DE ENERGÍA, S.L.U."},{"$f":"'7_Factores de emisión'!H261","v":{"v":0,"d":"0.00"}},{"$f":"'7_Factores de emisión'!J261","v":"EDP Energía S.A.U."},{"$f":"'7_Factores de emisión'!N261","v":{"v":0.23999999463558197,"d":"0.24"}},{"$f":"'7_Factores de emisión'!E385","v":"COOPERATIVA VALENCIANA ELECTRODISTRIBUIDORA DE FUERZA Y ALUMBRADO SERRALLO, S.Coop.V."},{"$f":"'7_Factores de emisión'!H385","v":{"v":0,"d":"0.00"}},{"$f":"'7_Factores de emisión'!J385","v":"COMERCIALIZADORA ELECTRICA DE CADIZ, S.A."},{"$f":"'7_Factores de emisión'!N385","v":{"v":0,"d":"0.00"}},{"$f":"'7_Factores de emisión'!E564","v":"CEPSA COMERCIAL PETRÓLEO,\r S.A.U."},{"$f":"'7_Factores de emisión'!H564","v":{"v":0,"d":"0.00"}},null,{"$error":"#REF!"},{"$error":"#REF!"}]
[null,null,{"$f":"'4_Electricidad'!F55","v":0},{"$error":"#N/A"},{"$f":"IF(ISNUMBER('4_Electricidad'!H55),('4_Electricidad'!H55*'4_Electricidad'!I55),\"\")","v":""},"genérico",2,{"$nulls":7},{"$f":"'7_Factores de emisión'!E214","v":"SOM ENERGÍA, S.C.C.L."},{"$f":"'7_Factores de emisión'!H214","v":{"v":0,"d":"0.00"}},{"$f":"'7_Factores de emisión'!J214","v":"NATURGAS ENERGÍA COMERCIALIZADORA, S.A.U."},{"$f":"'7_Factores de emisión'!N214","v":{"v":0.20000000298023224,"d":"0.20"}},{"$f":"'7_Factores de emisión'!E262","v":"FACTOR ENERGÍA, S.A."},{"$f":"'7_Factores de emisión'!H262","v":{"v":0.3100000023841858,"d":"0.31"}},{"$f":"'7_Factores de emisión'!J262","v":"ELECNOVA SIGLO XXI, S.L."},{"$f":"'7_Factores de emisión'!N262","v":{"v":0,"d":"0.00"}},{"$f":"'7_Factores de emisión'!E386","v":"COX ENERGÍA COMERCIALIZADORA ESPAÑA, S.L.U."},{"$f":"'7_Factores de emisión'!H386","v":{"v":0,"d":"0.00"}},{"$f":"'7_Factores de emisión'!J386","v":"COMERCIALIZADORA ELÉCTRICA TALAYUELAS, S.L."},{"$f":"'7_Factores de emisión'!N386","v":{"v":0,"d":"0.00"}},{"$f":"'7_Factores de emisión'!E565","v":"CEPSA GAS Y ELECTRICIDAD, S.A."},{"$f":"'7_Factores de emisión'!H565","v":{"v":0,"d":"0.00"}},null,{"$error":"#REF!"},{"$error":"#REF!"}]
[null,null,{"$f":"'4_Electricidad'!F56","v":0},{"$error":"#N/A"},{"$f":"IF(ISNUMBER('4_Electricidad'!H56),('4_Electricidad'!H56*'4_Electricidad'!I56),\"\")","v":""},"genérico",2,{"$nulls":7},{"$f":"'7_Factores de emisión'!E215","v":"UNIELÉCTRICA ENERGÍA, S.L."},{"$f":"'7_Factores de emisión'!H215","v":{"v":0,"d":"0.00"}},{"$f":"'7_Factores de emisión'!J215","v":"NEXUS ENERGÍA, S.A."},{"$f":"'7_Factores de emisión'!N215","v":{"v":0.12999999523162842,"d":"0.13"}},{"$f":"'7_Factores de emisión'!E263","v":"FENIE ENERGÍA, S.A."},{"$f":"'7_Factores de emisión'!H263","v":{"v":0.36000001430511475,"d":"0.36"}},{"$f":"'7_Factores de emisión'!J263","v":"ELECTRA DEL CARDENER ENERGÍA, S.A."},{"$f":"'7_Factores de emisión'!N263","v":{"v":0,"d":"0.00"}},{"$f":"'7_Factores de emisión'!E387","v":"CYE ENERGÍA, S.L."},{"$f":"'7_Factores de emisión'!H387","v":{"v":0,"d":"0.00"}},{"$f":"'7_Factores de emisión'!J387","v":"COMERCIALIZADORA LERSA , S.L."},{"$f":"'7_Factores de emisión'!N387","v":{"v":0,"d":"0.00"}},{"$f":"'7_Factores de emisión'!E566","v":"CIDE HCENERGÍA S.A."},{"$f":"'7_Factores de emisión'!H566","v":{"v":0.3100000023841858,"d":"0.31"}},null,{"$error":"#REF!"},{"$error":"#REF!"}]
[null,null,{"$f":"'4_Electricidad'!F57","v":0},{"$error":"#N/A"},{"$f":"IF(ISNUMBER('4_Electricidad'!H57),('4_Electricidad'!H57*'4_Electricidad'!I57),\"\")","v":""},"genérico",2,{"$nulls":7},{"$f":"'7_Factores de emisión'!E216","v":"UNION FENOSA COMERCIAL, S.L."},{"$f":"'7_Factores de emisión'!H216","v":{"v":0.36000001430511475,"d":"0.36"}},{"$f":"'7_Factores de emisión'!J216","v":"NEXUS RENOVABLES, S.L."},{"$f":"'7_Factores de emisión'!N216","v":{"v":0,"d":"0.00"}},{"$f":"'7_Factores de emisión'!E264","v":"GAS NATURAL COMERCIALIZADORA, S.A."},{"$f":"'7_Factores de emisión'!H264","v":{"v":0.3499999940395355,"d":"0.35"}},{"$f":"'7_Factores de emisión'!J264","v":"ELÉCTRICA ALBATERENSE, S.L."},{"$f":"'7_Factores de emisión'!N264","v":{"v":0,"d":"0.00"}},{"$f":"'7_Factores de emisión'!E388","v":"DAIMUZ ENERGÍA, S.L."},{"$f":"'7_Factores de emisión'!H388","v":{"v":0,"d":"0.00"}},{"$f":"'7_Factores de emisión'!J388","v":"COMPAÑÍA ESCANDINAVA DE ELECTRICIDAD EN ESPAÑA, S.L."},{"$f":"'7_Factores de emisión'!N388","v":{"v":0,"d":"0.00"}},{"$f":"'7_Factores de emisión'!E567","v":"CLIDOM ENERGY, S.L."},{"$f":"'7_Factores de emisión'!H567","v":{"v":0,"d":"0.00"}},null,{"$error":"#REF!"},{"$error":"#REF!"}]
[null,null,{"$f":"'4_Electricidad'!F58","v":0},{"$error":"#N/A"},{"$f":"IF(ISNUMBER('4_Electricidad'!H58),('4_Electricidad'!H58*'4_Electricidad'!I58),\"\")","v":""},"genérico",2,{"$nulls":7},{"$f":"'7_Factores de emisión'!E217","v":"ZENCER, S. COOP. AND"},{"$f":"'7_Factores de emisión'!H217","v":{"v":0,"d":"0.00"}},{"$f":"'7_Factores de emisión'!J217","v":"OLTEN-LLUM, S.L."},{"$f":"'7_Factores de emisión'!N217","v":{"v":0.3400000035762787,"d":"0.34"}},{"$f":"'7_Factores de emisión'!E265","v":"GAS NATURAL SERVICIOS SDG, S.A."},{"$f":"'7_Factores de emisión'!H265","v":{"v":0.36000001430511475,"d":"0.36"}},{"$f":"'7_Factores de emisión'!J265","v":"ELÉCTRICA ALGIMIA DE ALFARA, S.COOP.V."},{"$f":"'7_Factores de emisión'!N265","v":{"v":0,"d":"0.00"}},{"$f":"'7_Factores de emisión'!E389","v":"DISA ENERGÍA ELÉCTRICA, S.L.U."},{"$f":"'7_Factores de emisión'!H389","v":{"v":0,"d":"0.00"}},{"$f":"'7_Factores de emisión'!J389","v":"COOPERATIVA ELECTRICA DE CASTELLAR, S.C.V."},{"$f":"'7_Factores de emisión'!N389","v":{"v":0,"d":"0.00"}},{"$f":"'7_Factores de emisión'!E568","v":"COMERCIALIZADORA DE ELECTRICIDAD Y GAS DEL MEDITERRÁNEO, S.L."},{"$f":"'7_Factores de emisión'!H568","v":{"v":0,"d":"0.00"}},null,{"$error":"#REF!"},{"$error":"#REF!"}]
[null,null,{"$f":"'4_Electricidad'!F59","v":0},{"$error":"#N/A"},{"$f":"IF(ISNUMBER('4_Electricidad'!H59),('4_Electricidad'!H59*'4_Electricidad'!I59),\"\")","v":""},"genérico",2,{"$nulls":7},"Varias comercializadoras",{"$f":"'7_Factores de emisión'!E180","v":0.36},{"$f":"'7_Factores de emisión'!J218","v":"ON DEMAND FACILITIES, S.L."},{"$f":"'7_Factores de emisión'!N218","v":{"v":0.3700000047683716,"d":"0.37"}},{"$f":"'7_Factores de emisión'!E266","v":"GDF SUEZ ENERGÍA ESPAÑA, S.A.U."},{"$f":"'7_Factores de emisión'!H266","v":{"v":0.3499999940395355,"d":"0.35"}},{"$f":"'7_Factores de emisión'!J266","v":"ELÉCTRICA CATRALENSE, S.L."},{"$f":"'7_Factores de emisión'!N266","v":{"v":0.029999999329447746,"d":"0.03"}},{"$f":"'7_Factores de emisión'!E390","v":"DREUE ELECTRIC, S.L."},{"$f":"'7_Factores de emisión'!H390","v":{"v":0.25999999046325684,"d":"0.26"}},{"$f":"'7_Factores de emisión'!J390","v":"COOPERATIVA ELÉCTRICA BENÉFICA CATRALENSE, COOP. V."},{"$f":"'7_Factores de emisión'!N390","v":{"v":0,"d":"0.00"}},{"$f":"'7_Factores de emisión'!E569","v":"COMERCIALIZADORA ELECTRICA DE CADIZ, S.A."},{"$f":"'7_Factores de emisión'!H569","v":{"v":0,"d":"0.00"}},null,{"$error":"#REF!"},{"$error":"#REF!"}]
[null,null,{"$f":"'4_Electricidad'!F60","v":0},{"$error":"#N/A"},{"$f":"IF(ISNUMBER('4_Electricidad'!H60),('4_Electricidad'!H60*'4_Electricidad'!I60),\"\")","v":""},"genérico",2,{"$nulls":7},"Otras",{"$f":"P221","v":0.36},{"$f":"'7_Factores de emisión'!J219","v":"SOM ENERGÍA, S.C.C.L."},{"$f":"'7_Factores de emisión'!N219","v":{"v":0,"d":"0.00"}},{"$f":"'7_Factores de emisión'!E267","v":"GEOATLANTER, S.L."},{"$f":"'7_Factores de emisión'!H267","v":{"v":0.14000000059604645,"d":"0.14"}},{"$f":"'7_Factores de emisión'!J267","v":"ELÉCTRICA DE CHERA, S.C.V."},{"$f":"'7_Factores de emisión'!N267","v":{"v":0,"d":"0.00"}},{"$f":"'7_Factores de emisión'!E391","v":"DRK ENERGY, S.L."},{"$f":"'7_Factores de emisión'!H391","v":{"v":0.019999999552965164,"d":"0.02"}},{"$f":"'7_Factores de emisión'!J391","v":"COOPERATIVA ELÉCTRICA BENÉFICA SAN FRANCISCO DE ASÍS, COOP. V."},{"$f":"'7_Factores de emisión'!N391","v":{"v":0,"d":"0.00"}},{"$f":"'7_Factores de emisión'!E570","v":"COMERCIALIZADORA ELECTRICA PENINSULAR, S.L."},{"$f":"'7_Factores de emisión'!H570","v":{"v":0.3100000023841858,"d":"0.31"}},null,{"$error":"#REF!"},{"$error":"#REF!"}]
[null,null,{"$f":"'4_Electricidad'!F61","v":0},{"$error":"#N/A"},{"$f":"IF(ISNUMBER('4_Electricidad'!H61),('4_Electricidad'!H61*'4_Electricidad'!I61),\"\")","v":""},"genérico",2,{"$nulls":9},{"$f":"'7_Factores de emisión'!J220","v":"THE YELLOW ENERGY, S.L."},{"$f":"'7_Factores de emisión'!N220","v":{"v":0,"d":"0.00"}},{"$f":"'7_Factores de emisión'!E268","v":"GESTERNOVA, S.A."},{"$f":"'7_Factores de emisión'!H268","v":{"v":0,"d":"0.00"}},{"$f":"'7_Factores de emisión'!J268","v":"ELÉCTRICA DE GUADASSUAR COOP. V."},{"$f":"'7_Factores de emisión'!N268","v":{"v":0,"d":"0.00"}},{"$f":"'7_Factores de emisión'!E392","v":"ECOFUTURA LUZ ENERGÍA, S.L."},{"$f":"'7_Factores de emisión'!H392","v":{"v":0,"d":"0.00"}},{"$f":"'7_Factores de emisión'!J392","v":"COOPERATIVA ELÉCTRICA-BENÉFICA ALBATERENSE, COOP.V."},{"$f":"'7_Factores de emisión'!N392","v":{"v":0,"d":"0.00"}},{"$f":"'7_Factores de emisión'!E571","v":"COMERCIALIZADORA ELÉCTRICA TALAYUELAS, S.L."},{"$f":"'7_Factores de emisión'!H571","v":{"v":0.07000000029802322,"d":"0.07"}},null,{"$error":"#REF!"},{"$error":"#REF!"}]
[null,null,{"$f":"'4_Electricidad'!F62","v":0},{"$error":"#N/A"},{"$f":"IF(ISNUMBER('4_Electricidad'!H62),('4_Electricidad'!H62*'4_Electricidad'!I62),\"\")","v":""},"genérico",2,{"$nulls":9},{"$f":"'7_Factores de emisión'!J221","v":"UNIELÉCTRICA ENERGÍA, S.A."},{"$f":"'7_Factores de emisión'!N221","v":{"v":0,"d":"0.00"}},{"$f":"'7_Factores de emisión'!E269","v":"GNERA ENERGÍA Y TECNOLOGIA, S.L."},{"$f":"'7_Factores de emisión'!H269","v":{"v":0,"d":"0.00"}},{"$f":"'7_Factores de emisión'!J269","v":"ELÉCTRICA DIRECTA ENERGÍA, S.L."},{"$f":"'7_Factores de emisión'!N269","v":{"v":0,"d":"0.00"}},{"$f":"'7_Factores de emisión'!E393","v":"EDP COMERCIALIZADORA, S.A.U."},{"$f":"'7_Factores de emisión'!H393","v":{"v":0.25999999046325684,"d":"0.26"}},{"$f":"'7_Factores de emisión'!J393","v":"COOPERATIVA VALENCIANA ELECTRODISTRIBUIDORA DE FUERZA Y ALUMBRADO SERRALLO, S.Coop.V."},{"$f":"'7_Factores de emisión'!N393","v":{"v":0,"d":"0.00"}},{"$f":"'7_Factores de emisión'!E572","v":"COMERCIALIZADORA ENERGÉTICA SOSTENIBLE, S.A.U."},{"$f":"'7_Factores de emisión'!H572","v":{"v":0,"d":"0.00"}},null,{"$error":"#REF!"},{"$error":"#REF!"}]
[null,null,{"$f":"'4_Electricidad'!F63","v":0},{"$error":"#N/A"},{"$f":"IF(ISNUMBER('4_Electricidad'!H63),('4_Electricidad'!H63*'4_Electricidad'!I63),\"\")","v":""},"genérico",2,{"$nulls":9},{"$f":"'7_Factores de emisión'!J222","v":"VERTSEL ENERGÍA, S.L.U."},{"$f":"'7_Factores de emisión'!N222","v":{"v":0.019999999552965164,"d":"0.02"}},{"$f":"'7_Factores de emisión'!E270","v":"GOIENER S.COOP"},{"$f":"'7_Factores de emisión'!H270","v":{"v":0.009999999776482582,"d":"0.01"}},{"$f":"'7_Factores de emisión'!J270","v":"ELÉCTRICA SOLLERENSE, S.A."},{"$f":"'7_Factores de emisión'!N270","v":{"v":0,"d":"0.00"}},{"$f":"'7_Factores de emisión'!E394","v":"EDP ENERGÍA S.A.U."},{"$f":"'7_Factores de emisión'!H394","v":0.25},{"$f":"'7_Factores de emisión'!J394","v":"COX ENERGÍA COMERCIALIZADORA ESPAÑA, S.L.U."},{"$f":"'7_Factores de emisión'!N394","v":{"v":0,"d":"0.00"}},{"$f":"'7_Factores de emisión'!E573","v":"COMERCIALIZADORA LERSA , S.L."},{"$f":"'7_Factores de emisión'!H573","v":{"v":0.009999999776482582,"d":"0.01"}},null,{"$error":"#REF!"},{"$error":"#REF!"}]
[null,null,{"$f":"'4_Electricidad'!F64","v":0},{"$error":"#N/A"},{"$f":"IF(ISNUMBER('4_Electricidad'!H64),('4_Electricidad'!H64*'4_Electricidad'!I64),\"\")","v":""},"genérico",2,{"$nulls":9},{"$f":"'7_Factores de emisión'!J223","v":"ZENCER, S. COOP. AND"},{"$f":"'7_Factores de emisión'!N223","v":{"v":0.1599999964237213,"d":"0.16"}},{"$f":"'7_Factores de emisión'!E271","v":"HIDROCANTABRICO ENERGÍA, S.A. Unipersonal"},{"$f":"'7_Factores de emisión'!H271","v":{"v":0.23000000417232513,"d":"0.23"}},{"$f":"'7_Factores de emisión'!J271","v":"ELECTRODISTRIBUIDORA DE FUERZA Y ALUMBRADO CASABLANCA, S. COOP.V."},{"$f":"'7_Factores de emisión'!N271","v":{"v":0,"d":"0.00"}},{"$f":"'7_Factores de emisión'!E395","v":"ELECNOVA SIGLO XXI, S.L."},{"$f":"'7_Factores de emisión'!H395","v":{"v":0,"d":"0.00"}},{"$f":"'7_Factores de emisión'!J395","v":"CYE ENERGÍA, S.L."},{"$f":"'7_Factores de emisión'!N395","v":{"v":0.009999999776482582,"d":"0.01"}},{"$f":"'7_Factores de emisión'!E574","v":"COMPAÑÍA ESCANDINAVA DE ELECTRICIDAD EN ESPAÑA, S.L."},{"$f":"'7_Factores de emisión'!H574","v":{"v":0,"d":"0.00"}},null,{"$error":"#REF!"},{"$error":"#REF!"}]
[null,null,{"$f":"'4_Electricidad'!F65","v":0},{"$error":"#N/A"},{"$f":"IF(ISNUMBER('4_Electricidad'!H65),('4_Electricidad'!H65*'4_Electricidad'!I65),\"\")","v":""},"genérico",2,{"$nulls":9},"Varias comercializadoras",{"$f":"'7_Factores de emisión'!J180","v":0.37},{"$f":"'7_Factores de emisión'!E272","v":"HIDROELECTRICA DEL VALIRA, S.L."},{"$f":"'7_Factores de emisión'!H272","v":{"v":0.30000001192092896,"d":"0.30"}},{"$f":"'7_Factores de emisión'!J272","v":"ELYGAS POWER, S.L."},{"$f":"'7_Factores de emisión'!N272","v":{"v":0,"d":"0.00"}},{"$f":"'7_Factores de emisión'!E396","v":"ELECTRA CALDENSE ENERGÍA, S.A."},{"$f":"'7_Factores de emisión'!H396","v":{"v":0,"d":"0.00"}},{"$f":"'7_Factores de emisión'!J396","v":"DAIMUZ ENERGÍA, S.L."},{"$f":"'7_Factores de emisión'!N396","v":{"v":0,"d":"0.00"}},{"$f":"'7_Factores de emisión'!E575","v":"COOPERATIVA ELÉCTRICA BENÉFICA CATRALENSE, COOP. V."},{"$f":"'7_Factores de emisión'!H575","v":{"v":0,"d":"0.00"}},null,{"$error":"#REF!"},{"$error":"#REF!"}]
[null,null,{"$f":"'4_Electricidad'!F66","v":0},{"$error":"#N/A"},{"$f":"IF(ISNUMBER('4_Electricidad'!H66),('4_Electricidad'!H66*'4_Electricidad'!I66),\"\")","v":""},"genérico",2,{"$nulls":9},"Otras",{"$f":"R227","v":0.37},{"$f":"'7_Factores de emisión'!E273","v":"HIDROELÉCTRICA EL CARMEN ENERGÍA, S.L."},{"$f":"'7_Factores de emisión'!H273","v":{"v":0,"d":"0.00"}},{"$f":"'7_Factores de emisión'!J273","v":"ELÉCTRICA DE MELIANA, S.C.V."},{"$f":"'7_Factores de emisión'!N273","v":{"v":0,"d":"0.00"}},{"$f":"'7_Factores de emisión'!E397","v":"ELECTRA DEL CARDENER ENERGÍA, S.A."},{"$f":"'7_Factores de emisión'!H397","v":{"v":0,"d":"0.00"}},{"$f":"'7_Factores de emisión'!J397","v":"DISA ENERGÍA ELECTRICA, S.L.U."},{"$f":"'7_Factores de emisión'!N397","v":{"v":0,"d":"0.00"}},{"$f":"'7_Factores de emisión'!E576","v":"COOPERATIVA ELÉCTRICA BENÉFICA SAN FRANCISCO DE ASÍS, COOP. V."},{"$f":"'7_Factores de emisión'!H576","v":{"v":0.009999999776482582,"d":"0.01"}},null,{"$error":"#REF!"},{"$error":"#REF!"}]
[null,null,{"$f":"'4_Electricidad'!F67","v":0},{"$error":"#N/A"},{"$f":"IF(ISNUMBER('4_Electricidad'!H67),('4_Electricidad'!H67*'4_Electricidad'!I67),\"\")","v":""},"genérico",2,{"$nulls":11},{"$f":"'7_Factores de emisión'!E274","v":"IBERDROLA CLIENTES, S.A.U."},{"$f":"'7_Factores de emisión'!H274","v":{"v":0.20999999344348907,"d":"0.21"}},{"$f":"'7_Factores de emisión'!J274","v":"ELÉCTRICA DE SOT DE CHERA S. COOP.V."},{"$f":"'7_Factores de emisión'!N274","v":{"v":0,"d":"0.00"}},{"$f":"'7_Factores de emisión'!E398","v":"ELÉCTRICA ALBATERENSE, S.L."},{"$f":"'7_Factores de emisión'!H398","v":{"v":0,"d":"0.00"}},{"$f":"'7_Factores de emisión'!J398","v":"DREUE ELECTRIC, S.L."},{"$f":"'7_Factores de emisión'!N398","v":{"v":0.4000000059604645,"d":"0.40"}},{"$f":"'7_Factores de emisión'!E577","v":"COOPERATIVA ELECTRICA DE CASTELLAR, S.C.V."},{"$f":"'7_Factores de emisión'!H577","v":{"v":0,"d":"0.00"}},null,{"$error":"#REF!"},{"$error":"#REF!"}]
[null,null,{"$f":"'4_Electricidad'!F68","v":0},{"$error":"#N/A"},{"$f":"IF(ISNUMBER('4_Electricidad'!H68),('4_Electricidad'!H68*'4_Electricidad'!I68),\"\")","v":""},"genérico",2,{"$nulls":11},{"$f":"'7_Factores de emisión'!E275","v":"INDEXO ENERGÍA, S.L."},{"$f":"'7_Factores de emisión'!H275","v":{"v":0.10000000149011612,"d":"0.10"}},{"$f":"'7_Factores de emisión'!J275","v":"ELÉCTRICA DE VINALESA, S.L.U."},{"$f":"'7_Factores de emisión'!N275","v":{"v":0.03999999910593033,"d":"0.04"}},{"$f":"'7_Factores de emisión'!E399","v":"ELÉCTRICA CATRALENSE, S.L."},{"$f":"'7_Factores de emisión'!H399","v":{"v":0,"d":"0.00"}},{"$f":"'7_Factores de emisión'!J399","v":"DRK ENERGY, S.L."},{"$f":"'7_Factores de emisión'!N399","v":{"v":0,"d":"0.00"}},{"$f":"'7_Factores de emisión'!E578","v":"COOPERATIVA ELÉCTRICA-BENÉFICA ALBATERENSE, COOP.V."},{"$f":"'7_Factores de emisión'!H578","v":{"v":0,"d":"0.00"}},null,{"$error":"#REF!"},{"$error":"#REF!"}]
["5_Información adicional",{"$nulls":3},{"$f":"SUM(E211:E230)","v":{"v":0,"d":"0.00"}},{"$nulls":13},{"$f":"'7_Factores de emisión'!E276","v":"INICIATIVA E. NOVA, S.L."},{"$f":"'7_Factores de emisión'!H276","v":{"v":0,"d":"0.00"}},{"$f":"'7_Factores de emisión'!J276","v":"ELÉCTRICA DEL POZO, S.COOP.MAD."},{"$f":"'7_Factores de emisión'!N276","v":{"v":0,"d":"0.00"}},{"$f":"'7_Factores de emisión'!E400","v":"ELÉCTRICA DE CHERA, S.C.V."},{"$f":"'7_Factores de emisión'!H400","v":{"v":0,"d":"0.00"}},{"$f":"'7_Factores de emisión'!J400","v":"ECOEQ ENERGÉTICA, S.L."},{"$f":"'7_Factores de emisión'!N400","v":{"v":0.4000000059604645,"d":"0.40"}},{"$f":"'7_Factores de emisión'!E579","v":"COOPERATIVA VALENCIANA ELECTRODISTRIBUIDORA DE FUERZA Y ALUMBRADO SERRALLO, S.Coop.V."},{"$f":"'7_Factores de emisión'!H579","v":{"v":0,"d":"0.00"}},null,{"$error":"#REF!"},{"$error":"#REF!"}]
[null,null,"Lista tipo \nde ER","Lista tipo de biomasa",{"$nulls":14},{"$f":"'7_Factores de emisión'!E277","v":"LA UNION ELECTRO INDUSTRIAL, S.L. \"UNIPERSONAL\""},{"$f":"'7_Factores de emisión'!H277","v":{"v":0,"d":"0.00"}},{"$f":"'7_Factores de emisión'!J277","v":"ELÉCTRICA NTRA. SRA. DE GRACIA SDAD. COOP. VALENCIANA"},{"$f":"'7_Factores de emisión'!N277","v":{"v":0,"d":"0.00"}},{"$f":"'7_Factores de emisión'!E401","v":"ELÉCTRICA DE GUADASSUAR COOP. V."},{"$f":"'7_Factores de emisión'!H401","v":{"v":0,"d":"0.00"}},{"$f":"'7_Factores de emisión'!J401","v":"ECOFUTURA LUZ ENERGÍA, S.L."},{"$f":"'7_Factores de emisión'!N401","v":{"v":0.15000000596046448,"d":"0.15"}},{"$f":"'7_Factores de emisión'!E580","v":"COX ENERGÍA COMERCIALIZADORA ESPAÑA, S.L.U."},{"$f":"'7_Factores de emisión'!H580","v":{"v":0,"d":"0.00"}},null,{"$error":"#REF!"},{"$error":"#REF!"}]
[null,null,"Biomásica","Astillas",{"$nulls":14},{"$f":"'7_Factores de emisión'!E278","v":"LIGHT UP, S.L."},{"$f":"'7_Factores de emisión'!H278","v":{"v":0,"d":"0.00"}},{"$f":"'7_Factores de emisión'!J278","v":"EMASP, S. COOP."},{"$f":"'7_Factores de emisión'!N278","v":{"v":0,"d":"0.00"}},{"$f":"'7_Factores de emisión'!E402","v":"ELÉCTRICA DE GUIXES ENERG¿A, S.L."},{"$f":"'7_Factores de emisión'!H402","v":{"v":0.30000001192092896,"d":"0.30"}},{"$f":"'7_Factores de emisión'!J402","v":"ECONACTIVA, S. COOP DE C-LM"},{"$f":"'7_Factores de emisión'!N402","v":{"v":0,"d":"0.00"}},{"$f":"'7_Factores de emisión'!E581","v":"CYE ENERGÍA, S.L."},{"$f":"'7_Factores de emisión'!H581","v":{"v":0,"d":"0.00"}},null,{"$error":"#REF!"},{"$error":"#REF!"}]
[null,null,"Eólica","Carbón vegetal",{"$nulls":14},{"$f":"'7_Factores de emisión'!E279","v":"LUCI MUNDI ENERGÍA, S.L."},{"$f":"'7_Factores de emisión'!H279","v":{"v":0.17000000178813934,"d":"0.17"}},{"$f":"'7_Factores de emisión'!J279","v":"ENARA GESTIÓN Y MEDIACIÓN, S.L."},{"$f":"'7_Factores de emisión'!N279","v":{"v":0,"d":"0.00"}},{"$f":"'7_Factores de emisión'!E403","v":"ELÉCTRICA DIRECTA ENERGÍA, S.L."},{"$f":"'7_Factores de emisión'!H403","v":{"v":0.05999999865889549,"d":"0.06"}},{"$f":"'7_Factores de emisión'!J403","v":"EDP COMERCIALIZADORA, S.A.U."},{"$f":"'7_Factores de emisión'!N403","v":{"v":0.23000000417232513,"d":"0.23"}},{"$f":"'7_Factores de emisión'!E582","v":"DAIMUZ ENERGÍA, S.L."},{"$f":"'7_Factores de emisión'!H582","v":{"v":0,"d":"0.00"}},null,{"$error":"#REF!"},{"$error":"#REF!"}]
[null,null,"Geotérmica","Madera",{"$nulls":14},{"$f":"'7_Factores de emisión'!E280","v":"NATURGAS ENERGÍA COMERCIALIZADORA, S.A.U."},{"$f":"'7_Factores de emisión'!H280","v":{"v":0.23000000417232513,"d":"0.23"}},{"$f":"'7_Factores de emisión'!J280","v":"ENDESA ENERGÍA, S.A."},{"$f":"'7_Factores de emisión'!N280","v":{"v":0.3400000035762787,"d":"0.34"}},{"$f":"'7_Factores de emisión'!E404","v":"ELÉCTRICA SOLLERENSE, S.A."},{"$f":"'7_Factores de emisión'!H404","v":{"v":0,"d":"0.00"}},{"$f":"'7_Factores de emisión'!J404","v":"EDP ENERGÍA S.A.U."},{"$f":"'7_Factores de emisión'!N404","v":{"v":0.23000000417232513,"d":"0.23"}},{"$f":"'7_Factores de emisión'!E583","v":"DISA ENERGÍA ELÉCTRICA, S.L.U."},{"$f":"'7_Factores de emisión'!H583","v":{"v":0,"d":"0.00"}},null,{"$error":"#REF!"},{"$error":"#REF!"}]
[null,null,"Hidráulica","Pélet",{"$nulls":14},{"$f":"'7_Factores de emisión'!E281","v":"NEXUS ENERGÍA, S.A."},{"$f":"'7_Factores de emisión'!H281","v":{"v":0.11999999731779099,"d":"0.12"}},{"$f":"'7_Factores de emisión'!J281","v":"ENERCOLUZ ENERGÍA, S.L."},{"$f":"'7_Factores de emisión'!N281","v":{"v":0.30000001192092896,"d":"0.30"}},{"$f":"'7_Factores de emisión'!E405","v":"ELÉCTRICA DE MELIANA, S.C.V."},{"$f":"'7_Factores de emisión'!H405","v":{"v":0,"d":"0.00"}},{"$f":"'7_Factores de emisión'!J405","v":"ELECNOVA SIGLO XXI, S.L."},{"$f":"'7_Factores de emisión'!N405","v":{"v":0.3499999940395355,"d":"0.35"}},{"$f":"'7_Factores de emisión'!E584","v":"DREUE ELECTRIC, S.L."},{"$f":"'7_Factores de emisión'!H584","v":{"v":0.2800000011920929,"d":"0.28"}},null,{"$error":"#REF!"},{"$error":"#REF!"}]
[null,null,"Solar","Residuos agrícolas",{"$nulls":14},{"$f":"'7_Factores de emisión'!E282","v":"NEXUS RENOVABLES, S.L."},{"$f":"'7_Factores de emisión'!H282","v":{"v":0.019999999552965164,"d":"0.02"}},{"$f":"'7_Factores de emisión'!J282","v":"ENERGEA SAVING ENERGY, S.L."},{"$f":"'7_Factores de emisión'!N282","v":{"v":0,"d":"0.00"}},{"$f":"'7_Factores de emisión'!E406","v":"ELÉCTRICA DE SOT DE CHERA S. COOP.V."},{"$f":"'7_Factores de emisión'!H406","v":{"v":0,"d":"0.00"}},{"$f":"'7_Factores de emisión'!J406","v":"ELECTRA ALTO MIÑO COMERCIALIZADORA DE ENERGÍA, S.L.U."},{"$f":"'7_Factores de emisión'!N406","v":{"v":0.4099999964237213,"d":"0.41"}},{"$f":"'7_Factores de emisión'!E585","v":"DRK ENERGY, S.L."},{"$f":"'7_Factores de emisión'!H585","v":{"v":0.23000000417232513,"d":"0.23"}},null,{"$error":"#REF!"},{"$error":"#REF!"}]
[{"$nulls":3},"Residuos de madera",{"$nulls":14},{"$f":"'7_Factores de emisión'!E283","v":"ON DEMAND FACILITIES, S.L."},{"$f":"'7_Factores de emisión'!H283","v":{"v":0.03999999910593033,"d":"0.04"}},{"$f":"'7_Factores de emisión'!J283","v":"ENERGÍA NARANJA, S.L."},{"$f":"'7_Factores de emisión'!N283","v":{"v":0,"d":"0.00"}},{"$f":"'7_Factores de emisión'!E407","v":"ELÉCTRICA DE VINALESA, S.L.U."},{"$f":"'7_Factores de emisión'!H407","v":{"v":0.05999999865889549,"d":"0.06"}},{"$f":"'7_Factores de emisión'!J407","v":"ELECTRA CALDENSE ENERGÍA, S.A."},{"$f":"'7_Factores de emisión'!N407","v":{"v":0,"d":"0.00"}},{"$f":"'7_Factores de emisión'!E586","v":"ECOEQ ENERGÉTICA, S.L."},{"$f":"'7_Factores de emisión'!H586","v":{"v":0.1599999964237213,"d":"0.16"}},null,{"$error":"#REF!"},{"$error":"#REF!"}]
[{"$nulls":18},{"$f":"'7_Factores de emisión'!E284","v":"PROT ENERGÍA COMERCIALIZACIÓN, S.L."},{"$f":"'7_Factores de emisión'!H284","v":{"v":0,"d":"0.00"}},{"$f":"'7_Factores de emisión'!J284","v":"ENERGY STROM XXI, S.L."},{"$f":"'7_Factores de emisión'!N284","v":{"v":0.3199999928474426,"d":"0.32"}},{"$f":"'7_Factores de emisión'!E408","v":"EMASP, S. COOP."},{"$f":"'7_Factores de emisión'!H408","v":{"v":0,"d":"0.00"}},{"$f":"'7_Factores de emisión'!J408","v":"ELECTRA CUNTIENSE COMERCIALIZADORA, S.L.U."},{"$f":"'7_Factores de emisión'!N408","v":{"v":0.4099999964237213,"d":"0.41"}},{"$f":"'7_Factores de emisión'!E587","v":"ECOFUTURA LUZ ENERGÍA, S.L."},{"$f":"'7_Factores de emisión'!H587","v":{"v":0.30000001192092896,"d":"0.30"}},null,{"$error":"#REF!"},{"$error":"#REF!"}]
["6_Resultados",{"$nulls":17},{"$f":"'7_Factores de emisión'!E285","v":"RENEWABLE VENTURES, S.L."},{"$f":"'7_Factores de emisión'!H285","v":{"v":0,"d":"0.00"}},{"$f":"'7_Factores de emisión'!J285","v":"ENERGY TRADER SOLUTIONS, S.L."},{"$f":"'7_Factores de emisión'!N285","v":{"v":0.3400000035762787,"d":"0.34"}},{"$f":"'7_Factores de emisión'!E409","v":"EMPRESA DE ALUMBRADO ELÉCTRICO DE CEUTA, S.A."},{"$f":"'7_Factores de emisión'!H409","v":{"v":0.41999998688697815,"d":"0.42"}},{"$f":"'7_Factores de emisión'!J409","v":"ELECTRA DEL CARDENER ENERGÍA, S.A."},{"$f":"'7_Factores de emisión'!N409","v":{"v":0,"d":"0.00"}},{"$f":"'7_Factores de emisión'!E588","v":"ECONACTIVA, S. COOP DE C-LM"},{"$f":"'7_Factores de emisión'!H588","v":{"v":0,"d":"0.00"}},null,{"$error":"#REF!"},{"$error":"#REF!"}]
[null,"Nombre organización",null,null,{"$f":"'1_Datos generales organización'!Y5","v":0},{"$nulls":13},{"$f":"'7_Factores de emisión'!E286","v":"SAMPOL INGENIERÍA Y OBRAS, S.A."},{"$f":"'7_Factores de emisión'!H286","v":{"v":0.3100000023841858,"d":"0.31"}},{"$f":"'7_Factores de emisión'!J286","v":"ENERGÍA COLECTIVA, S.L."},{"$f":"'7_Factores de emisión'!N286","v":{"v":0,"d":"0.00"}},{"$f":"'7_Factores de emisión'!E410","v":"ENARA GESTIÓN Y MEDIACIÓN, S.L."},{"$f":"'7_Factores de emisión'!H410","v":{"v":0,"d":"0.00"}},{"$f":"'7_Factores de emisión'!J410","v":"ELECTRA ENERGÍA, S.A.U."},{"$f":"'7_Factores de emisión'!N410","v":{"v":0.3700000047683716,"d":"0.37"}},{"$f":"'7_Factores de emisión'!E589","v":"EDP COMERCIALIZADORA, S.A.U."},{"$f":"'7_Factores de emisión'!H589","v":{"v":0.23000000417232513,"d":"0.23"}},null,{"$error":"#REF!"},{"$error":"#REF!"}]
[null,"Sector actividad",null,null,{"$f":"'1_Datos generales organización'!Y6","v":0},{"$nulls":13},{"$f":"'7_Factores de emisión'!E287","v":"SOM ENERGÍA, S.C.C.L."},{"$f":"'7_Factores de emisión'!H287","v":{"v":0,"d":"0.00"}},{"$f":"'7_Factores de emisión'!J287","v":"ENERGÍA DLR COMERCIALIZADORA, S.L."},{"$f":"'7_Factores de emisión'!N287","v":{"v":0.36000001430511475,"d":"0.36"}},{"$f":"'7_Factores de emisión'!E411","v":"ENDESA ENERGÍA, S.A."},{"$f":"'7_Factores de emisión'!H411","v":{"v":0.38999998569488525,"d":"0.39"}},{"$f":"'7_Factores de emisión'!J411","v":"ELECTRA NORTE ENERGÍA, S.A.U."},{"$f":"'7_Factores de emisión'!N411","v":{"v":0.4099999964237213,"d":"0.41"}},{"$f":"'7_Factores de emisión'!E590","v":"EDP ENERGÍA, S.A.U."},{"$f":"'7_Factores de emisión'!H590","v":{"v":0.11999999731779099,"d":"0.12"}},null,{"$error":"#REF!"},{"$error":"#REF!"}]
[null,"Año",null,null,{"$f":"'1_Datos generales organización'!G3","v":0},{"$nulls":13},{"$f":"'7_Factores de emisión'!E288","v":"SUMINISTROS ESPECIALES ALGINETENSES COOP. V."},{"$f":"'7_Factores de emisión'!H288","v":{"v":0,"d":"0.00"}},{"$f":"'7_Factores de emisión'!J288","v":"ENERPLUS ENERGÍA, S.A."},{"$f":"'7_Factores de emisión'!N288","v":{"v":0,"d":"0.00"}},{"$f":"'7_Factores de emisión'!E412","v":"ENERCOLUZ ENERGÍA, S.L."},{"$f":"'7_Factores de emisión'!H412","v":{"v":0,"d":"0.00"}},{"$f":"'7_Factores de emisión'!J412","v":"ELECTRICA ALBATERENSE, S.L."},{"$f":"'7_Factores de emisión'!N412","v":{"v":0,"d":"0.00"}},{"$f":"'7_Factores de emisión'!E591","v":"ELECNOVA SIGLO XXI, S.L."},{"$f":"'7_Factores de emisión'!H591","v":{"v":0,"d":"0.00"}},null,{"$error":"#REF!"},{"$error":"#REF!"}]
[null,"Resultado huella 1+2",null,null,{"$f":"'6_Resultados'!H21","v":{"v":0,"d":"0.00"}},{"$nulls":13},{"$f":"'7_Factores de emisión'!E289","v":"SYDER COMERCIALIZADORA VERDE, S.L."},{"$f":"'7_Factores de emisión'!H289","v":{"v":0,"d":"0.00"}},{"$f":"'7_Factores de emisión'!J289","v":"ENGIE ESPAÑA, S.L.U."},{"$f":"'7_Factores de emisión'!N289","v":{"v":0.3400000035762787,"d":"0.34"}},{"$f":"'7_Factores de emisión'!E413","v":"ENERGEA SAVING ENERGY, S.L."},{"$f":"'7_Factores de emisión'!H413","v":{"v":0,"d":"0.00"}},{"$f":"'7_Factores de emisión'!J413","v":"ELECTRICA CATRALENSE, S.L."},{"$f":"'7_Factores de emisión'!N413","v":{"v":0,"d":"0.00"}},{"$f":"'7_Factores de emisión'!E592","v":"ELECTRA AVELLANA COMERCIAL, S.L."},{"$f":"'7_Factores de emisión'!H592","v":{"v":0,"d":"0.00"}},null,{"$error":"#REF!"},{"$error":"#REF!"}]
[{"$nulls":18},{"$f":"'7_Factores de emisión'!E290","v":"TELEFÓNICA SOLUCIONES DE INFORMÁTICA Y COMUNICACIONES DE ESPAÑA, S.A.U."},{"$f":"'7_Factores de emisión'!H290","v":{"v":0.05000000074505806,"d":"0.05"}},{"$f":"'7_Factores de emisión'!J290","v":"ENÉRGYA VM GESTIÓN DE ENERGÍA, S.L.U."},{"$f":"'7_Factores de emisión'!N290","v":{"v":0,"d":"0.00"}},{"$f":"'7_Factores de emisión'!E414","v":"ENERGY STROM XXI, S.L."},{"$f":"'7_Factores de emisión'!H414","v":{"v":0.3700000047683716,"d":"0.37"}},{"$f":"'7_Factores de emisión'!J414","v":"ELECTRICA DE CHERA, S.C.V."},{"$f":"'7_Factores de emisión'!N414","v":{"v":0,"d":"0.00"}},{"$f":"'7_Factores de emisión'!E593","v":"ELECTRA CALDENSE ENERGÍA, S.A."},{"$f":"'7_Factores de emisión'!H593","v":{"v":0,"d":"0.00"}},null,{"$error":"#REF!"},{"$error":"#REF!"}]
[{"$nulls":18},{"$f":"'7_Factores de emisión'!E291","v":"THE YELLOW ENERGY, S.L."},{"$f":"'7_Factores de emisión'!H291","v":{"v":0,"d":"0.00"}},{"$f":"'7_Factores de emisión'!J291","v":"EPRESA ENERGÍA, S.A.U."},{"$f":"'7_Factores de emisión'!N291","v":{"v":0,"d":"0.00"}},{"$f":"'7_Factores de emisión'!E415","v":"ENERGÍA COLECTIVA, S.L."},{"$f":"'7_Factores de emisión'!H415","v":{"v":0,"d":"0.00"}},{"$f":"'7_Factores de emisión'!J415","v":"ELECTRICA DE GUADASSUAR COOP. V."},{"$f":"'7_Factores de emisión'!N415","v":{"v":0,"d":"0.00"}},{"$f":"'7_Factores de emisión'!E594","v":"ELECTRA DEL CARDENER ENERGÍA, S.A."},{"$f":"'7_Factores de emisión'!H594","v":{"v":0,"d":"0.00"}},null,{"$error":"#REF!"},{"$error":"#REF!"}]
[{"$nulls":3},"Año 1","Año 2","Año 3","Año de cálc.",{"$nulls":11},{"$f":"'7_Factores de emisión'!E292","v":"UNIELÉCTRICA ENERGÍA, S.A."},{"$f":"'7_Factores de emisión'!H292","v":{"v":0,"d":"0.00"}},{"$f":"'7_Factores de emisión'!J292","v":"ESTABANELL Y PAHISA MERCATOR, S.A."},{"$f":"'7_Factores de emisión'!N292","v":{"v":0,"d":"0.00"}},{"$f":"'7_Factores de emisión'!E416","v":"ENERGÍA DLR COMERCIALIZADORA, S.L."},{"$f":"'7_Factores de emisión'!H416","v":{"v":0.4300000071525574,"d":"0.43"}},{"$f":"'7_Factores de emisión'!J416","v":"ELECTRICA DE GUIXES ENERGÍA, S.L."},{"$f":"'7_Factores de emisión'!N416","v":{"v":0.3499999940395355,"d":"0.35"}},{"$f":"'7_Factores de emisión'!E595","v":"ELECTRA ENERGÍA, S.A.U."},{"$f":"'7_Factores de emisión'!H595","v":{"v":0,"d":"0.00"}},null,{"$error":"#REF!"},{"$error":"#REF!"}]
[null,null,"Año",{"$f":"IF(ISNUMBER('1_Datos generales organización'!H14),'1_Datos generales organización'!H14,\"\")","v":""},{"$f":"IF(ISNUMBER('1_Datos generales organización'!H16),'1_Datos generales organización'!H16,\"\")","v":""},{"$f":"IF(ISNUMBER('1_Datos generales organización'!H18),'1_Datos generales organización'!H18,\"\")","v":""},{"$f":"IF(ISNUMBER('1_Datos generales organización'!G3),'1_Datos generales organización'!G3,\"\")","v":""},{"$nulls":11},{"$f":"'7_Factores de emisión'!E293","v":"VERTSEL ENERGÍA, S.L.U."},{"$f":"'7_Factores de emisión'!H293","v":{"v":0,"d":"0.00"}},{"$f":"'7_Factores de emisión'!J293","v":"ESTRATEGIAS ELÉCTRICAS INTEGRALES, S.A."},{"$f":"'7_Factores de emisión'!N293","v":{"v":0.2800000011920929,"d":"0.28"}},{"$f":"'7_Factores de emisión'!E417","v":"ENERPLUS ENERGÍA, S.A."},{"$f":"'7_Factores de emisión'!H417","v":{"v":0.33000001311302185,"d":"0.33"}},{"$f":"'7_Factores de emisión'!J417","v":"ELECTRICA DIRECTA ENERGÍA, S.L."},{"$f":"'7_Factores de emisión'!N417","v":{"v":0,"d":"0.00"}},{"$f":"'7_Factores de emisión'!E596","v":"ELECTRA NORTE ENERGÍA, S.A.U."},{"$f":"'7_Factores de emisión'!H596","v":{"v":0.28999999165534973,"d":"0.29"}},null,{"$error":"#REF!"},{"$error":"#REF!"}]
[null,null,"Índice de actividad",{"$f":"'1_Datos generales organización'!K29","v":0},{"$f":"'1_Datos generales organización'!K30","v":0},{"$f":"'1_Datos generales organización'!K31","v":0},{"$f":"'1_Datos generales organización'!K27","v":0},{"$nulls":11},{"$f":"'7_Factores de emisión'!E294","v":"WATIUM, S.L."},{"$f":"'7_Factores de emisión'!H294","v":{"v":0,"d":"0.00"}},{"$f":"'7_Factores de emisión'!J294","v":"EXPORT INNOVATION GROUP S.L."},{"$f":"'7_Factores de emisión'!N294","v":{"v":0,"d":"0.00"}},{"$f":"'7_Factores de emisión'!E418","v":"ENGIE ESPAÑA, S.L.U."},{"$f":"'7_Factores de emisión'!H418","v":{"v":0.3799999952316284,"d":"0.38"}},{"$f":"'7_Factores de emisión'!J418","v":"ELECTRICA SEROSENSE, S.L."},{"$f":"'7_Factores de emisión'!N418","v":{"v":0.38999998569488525,"d":"0.39"}},{"$f":"'7_Factores de emisión'!E597","v":"ELECTRICA ALBATERENSE, S.L."},{"$f":"'7_Factores de emisión'!H597","v":{"v":0,"d":"0.00"}},null,{"$error":"#REF!"},{"$error":"#REF!"}]
[null,null,"m2",{"$f":"'1_Datos generales organización'!J40","v":0},{"$f":"'1_Datos generales organización'!J41","v":0},{"$f":"'1_Datos generales organización'!J42","v":0},{"$f":"'1_Datos generales organización'!J38","v":0},{"$nulls":11},{"$f":"'7_Factores de emisión'!E295","v":"ZENCER, S. COOP. AND"},{"$f":"'7_Factores de emisión'!H295","v":{"v":0,"d":"0.00"}},{"$f":"'7_Factores de emisión'!J295","v":"FACTOR ENERGÍA, S.A."},{"$f":"'7_Factores de emisión'!N295","v":{"v":0.28999999165534973,"d":"0.29"}},{"$f":"'7_Factores de emisión'!E419","v":"ENÉRGYA VM GESTIÓN DE ENERGÍA, S.L.U."},{"$f":"'7_Factores de emisión'!H419","v":{"v":0,"d":"0.00"}},{"$f":"'7_Factores de emisión'!J419","v":"ELECTRICA SOLLERENSE, S.A."},{"$f":"'7_Factores de emisión'!N419","v":{"v":0,"d":"0.00"}},{"$f":"'7_Factores de emisión'!E598","v":"ELECTRICA CATRALENSE, S.L."},{"$f":"'7_Factores de emisión'!H598","v":{"v":0,"d":"0.00"}},null,{"$error":"#REF!"},{"$error":"#REF!"}]
[null,null,"empleados",{"$f":"'1_Datos generales organización'!K40","v":0},{"$f":"'1_Datos generales organización'!K41","v":0},{"$f":"'1_Datos generales organización'!K42","v":0},{"$f":"'1_Datos generales organización'!K38","v":0},{"$nulls":11},"Varias comercializadoras",{"$f":"'7_Factores de emisión'!E228","v":{"v":0.4,"d":"0.40"}},{"$f":"'7_Factores de emisión'!J296","v":"FENIE ENERGÍA, S.A."},{"$f":"'7_Factores de emisión'!N296","v":{"v":0,"d":"0.00"}},{"$f":"'7_Factores de emisión'!E420","v":"ESTABANELL Y PAHISA MERCATOR, S.A."},{"$f":"'7_Factores de emisión'!H420","v":{"v":0,"d":"0.00"}},{"$f":"'7_Factores de emisión'!J420","v":"ELECTRICA VAQUER ENERGÍA, S.A."},{"$f":"'7_Factores de emisión'!N420","v":{"v":0,"d":"0.00"}},{"$f":"'7_Factores de emisión'!E599","v":"ELECTRICA DE CHERA, S.C.V."},{"$f":"'7_Factores de emisión'!H599","v":{"v":0,"d":"0.00"}},null,{"$f":"INDIRECT(\"_Com\"&$F$2)","v":{"$error":"#REF!"}},{"$f":"INDIRECT(\"_Mix\"&$F$2)","v":{"$error":"#REF!"}}]
[{"$nulls":18},"Otras",{"$f":"T251","v":{"v":0.4,"d":"0.40"}},{"$f":"'7_Factores de emisión'!J297","v":"FLUIDO ELÉCTRICO MUSEROS, SCV"},{"$f":"'7_Factores de emisión'!N297","v":{"v":0,"d":"0.00"}},{"$f":"'7_Factores de emisión'!E421","v":"ESTRATEGIAS ELÉCTRICAS INTEGRALES, S.A."},{"$f":"'7_Factores de emisión'!H421","v":{"v":0.3199999928474426,"d":"0.32"}},{"$f":"'7_Factores de emisión'!J421","v":"ELÉCTRICA DE MELIANA, S.C.V."},{"$f":"'7_Factores de emisión'!N421","v":{"v":0,"d":"0.00"}},{"$f":"'7_Factores de emisión'!E600","v":"ELECTRICA DE GUADASSUAR COOP. V."},{"$f":"'7_Factores de emisión'!H600","v":{"v":0,"d":"0.00"}},null,{"$error":"#REF!"},{"$error":"#REF!"}]
[{"$nulls":3},"Año 1","Año 2","Año 3","Año de cálc.",{"$nulls":13},{"$f":"'7_Factores de emisión'!J298","v":"FOENER COMERCIALIZACIÓN, S.L.U."},{"$f":"'7_Factores de emisión'!N298","v":{"v":0.36000001430511475,"d":"0.36"}},{"$f":"'7_Factores de emisión'!E422","v":"FACTOR ENERGÍA, S.A."},{"$f":"'7_Factores de emisión'!H422","v":{"v":0.3199999928474426,"d":"0.32"}},{"$f":"'7_Factores de emisión'!J422","v":"ELÉCTRICA DE SOT DE CHERA S. COOP.V."},{"$f":"'7_Factores de emisión'!N422","v":{"v":0,"d":"0.00"}},{"$f":"'7_Factores de emisión'!E601","v":"ELECTRICA DE GUIXES ENERGÍA, S.L."},{"$f":"'7_Factores de emisión'!H601","v":{"v":0.18000000715255737,"d":"0.18"}},null,{"$error":"#REF!"},{"$error":"#REF!"}]
[{"$nulls":3},{"$f":"IF(ISNUMBER(D248),D248,\"\")","v":""},{"$f":"IF(ISNUMBER(E248),E248,\"\")","v":""},{"$f":"IF(ISNUMBER(F248),F248,\"\")","v":""},{"$f":"IF(ISNUMBER(G248),G248,\"\")","v":""},{"$nulls":13},{"$f":"'7_Factores de emisión'!J299","v":"FUSIONA COMERCIALIZADORA, S.A."},{"$f":"'7_Factores de emisión'!N299","v":{"v":0,"d":"0.00"}},{"$f":"'7_Factores de emisión'!E423","v":"FENIE ENERGÍA, S.A."},{"$f":"'7_Factores de emisión'!H423","v":{"v":0,"d":"0.00"}},{"$f":"'7_Factores de emisión'!J423","v":"ELÉCTRICA DE VINALESA, S.L.U."},{"$f":"'7_Factores de emisión'!N423","v":{"v":0,"d":"0.00"}},{"$f":"'7_Factores de emisión'!E602","v":"ELÉCTRICA DE MELIANA, S.C.V."},{"$f":"'7_Factores de emisión'!H602","v":{"v":0,"d":"0.00"}},null,{"$error":"#REF!"},{"$error":"#REF!"}]
[null,null,"Emisiones absolutas (t CO2)",{"$f":"'1_Datos generales organización'!K14","v":0},{"$f":"'1_Datos generales organización'!K16","v":0},{"$f":"'1_Datos generales organización'!K18","v":0},{"$f":"E244","v":{"v":0,"d":"0.00"}},{"$nulls":13},{"$f":"'7_Factores de emisión'!J300","v":"GAOLANIA SERVICIOS, S.L."},{"$f":"'7_Factores de emisión'!N300","v":{"v":0.3400000035762787,"d":"0.34"}},{"$f":"'7_Factores de emisión'!E424","v":"FOENER COMERCIALIZACIÓN, S.L.U."},{"$f":"'7_Factores de emisión'!H424","v":{"v":0.36000001430511475,"d":"0.36"}},{"$f":"'7_Factores de emisión'!J424","v":"ELÉCTRICA NTRA. SRA. DE GRACIA SDAD. COOP. VALENCIANA"},{"$f":"'7_Factores de emisión'!N424","v":{"v":0.3700000047683716,"d":"0.37"}},{"$f":"'7_Factores de emisión'!E603","v":"ELÉCTRICA DE SOT DE CHERA S. COOP.V."},{"$f":"'7_Factores de emisión'!H603","v":{"v":0,"d":"0.00"}},null,{"$error":"#REF!"},{"$error":"#REF!"}]
[{"$nulls":20},{"$f":"'7_Factores de emisión'!J301","v":"GAS NATURAL COMERCIALIZADORA, S.A."},{"$f":"'7_Factores de emisión'!N301","v":{"v":0.28999999165534973,"d":"0.29"}},{"$f":"'7_Factores de emisión'!E425","v":"GALP ENERGÍA ESPAÑA S.A.U."},{"$f":"'7_Factores de emisión'!H425","v":{"v":0.4099999964237213,"d":"0.41"}},{"$f":"'7_Factores de emisión'!J425","v":"EMASP, S. COOP."},{"$f":"'7_Factores de emisión'!N425","v":{"v":0,"d":"0.00"}},{"$f":"'7_Factores de emisión'!E604","v":"ELECTRICA SEROSENSE, S.L."},{"$f":"'7_Factores de emisión'!H604","v":{"v":0.28999999165534973,"d":"0.29"}},null,{"$error":"#REF!"},{"$error":"#REF!"}]
[null,null,"HC SEGÚN ALCANCES",{"$nulls":17},{"$f":"'7_Factores de emisión'!J302","v":"GAS NATURAL SERVICIOS SDG, S.A."},{"$f":"'7_Factores de emisión'!N302","v":{"v":0.28999999165534973,"d":"0.29"}},{"$f":"'7_Factores de emisión'!E426","v":"GAOLANIA SERVICIOS, S.L."},{"$f":"'7_Factores de emisión'!H426","v":{"v":0,"d":"0.00"}},{"$f":"'7_Factores de emisión'!J426","v":"EMPRESA DE ALUMBRADO ELECTRICO DE CEUTA, S.A."},{"$f":"'7_Factores de emisión'!N426","v":{"v":0.4099999964237213,"d":"0.41"}},{"$f":"'7_Factores de emisión'!E605","v":"ELECTRICA SOLLERENSE, S.A."},{"$f":"'7_Factores de emisión'!H605","v":{"v":0,"d":"0.00"}},null,{"$error":"#REF!"},{"$error":"#REF!"}]
[{"$nulls":3},"Alcance 1","Alcance 2",{"$nulls":15},{"$f":"'7_Factores de emisión'!J303","v":"GEO ALTERNATIVA, S.L."},{"$f":"'7_Factores de emisión'!N303","v":{"v":0,"d":"0.00"}},{"$f":"'7_Factores de emisión'!E427","v":"GAS NATURAL COMERCIALIZADORA, S.A."},{"$f":"'7_Factores de emisión'!H427","v":{"v":0.3499999940395355,"d":"0.35"}},{"$f":"'7_Factores de emisión'!J427","v":"ENARA GESTIÓN Y MEDIACIÓN, S.L."},{"$f":"'7_Factores de emisión'!N427","v":{"v":0,"d":"0.00"}},{"$f":"'7_Factores de emisión'!E606","v":"ELECTRICA VAQUER ENERGÍA, S.A."},{"$f":"'7_Factores de emisión'!H606","v":{"v":0,"d":"0.00"}},null,{"$error":"#REF!"},{"$error":"#REF!"}]
[{"$nulls":3},{"$f":"'6_Resultados'!H17","v":0},{"$f":"'6_Resultados'!H19","v":0},{"$nulls":15},{"$f":"'7_Factores de emisión'!J304","v":"GEOATLANTER, S.L."},{"$f":"'7_Factores de emisión'!N304","v":{"v":0,"d":"0.00"}},{"$f":"'7_Factores de emisión'!E428","v":"GAS NATURAL FENOSA RENOVABLES, S.L.U."},{"$f":"'7_Factores de emisión'!H428","v":{"v":0,"d":"0.00"}},{"$f":"'7_Factores de emisión'!J428","v":"ENDESA ENERGÍA, S.A."},{"$f":"'7_Factores de emisión'!N428","v":{"v":0.3799999952316284,"d":"0.38"}},{"$f":"'7_Factores de emisión'!E607","v":"ELECTRICA VINALESA SDAD COOP VALENCIANA"},{"$f":"'7_Factores de emisión'!H607","v":{"v":0,"d":"0.00"}},null,{"$error":"#REF!"},{"$error":"#REF!"}]
[{"$nulls":20},{"$f":"'7_Factores de emisión'!J305","v":"GESTERNOVA, S.A."},{"$f":"'7_Factores de emisión'!N305","v":{"v":0,"d":"0.00"}},{"$f":"'7_Factores de emisión'!E429","v":"GAS NATURAL SERVICIOS SDG, S.A."},{"$f":"'7_Factores de emisión'!H429","v":{"v":0.38999998569488525,"d":"0.39"}},{"$f":"'7_Factores de emisión'!J429","v":"ENDESA GENERACIÓN, S.A."},{"$f":"'7_Factores de emisión'!N429","v":{"v":0,"d":"0.00"}},{"$f":"'7_Factores de emisión'!E608","v":"ELÉCTRICAS HIDROBESORA, S.L."},{"$f":"'7_Factores de emisión'!H608","v":{"v":0,"d":"0.00"}},null,{"$error":"#REF!"},{"$error":"#REF!"}]
[null,null,"Distribución alcance 1",{"$nulls":17},{"$f":"'7_Factores de emisión'!J306","v":"GIGABUSINESS, S.L."},{"$f":"'7_Factores de emisión'!N306","v":{"v":0.07000000029802322,"d":"0.07"}},{"$f":"'7_Factores de emisión'!E430","v":"GEO ALTERNATIVA, S.L."},{"$f":"'7_Factores de emisión'!H430","v":{"v":0,"d":"0.00"}},{"$f":"'7_Factores de emisión'!J430","v":"ENERCOLUZ ENERGÍA, S.L."},{"$f":"'7_Factores de emisión'!N430","v":{"v":0.1599999964237213,"d":"0.16"}},{"$f":"'7_Factores de emisión'!E609","v":"ELECTRICIDAD ELEIA S.L."},{"$f":"'7_Factores de emisión'!H609","v":{"v":0,"d":"0.00"}},null,{"$error":"#REF!"},{"$error":"#REF!"}]
[{"$nulls":20},{"$f":"'7_Factores de emisión'!J307","v":"GLOBAL BIOSFERA PROTEC, S.L."},{"$f":"'7_Factores de emisión'!N307","v":{"v":0.3199999928474426,"d":"0.32"}},{"$f":"'7_Factores de emisión'!E431","v":"GEOATLANTER, S.L."},{"$f":"'7_Factores de emisión'!H431","v":{"v":0,"d":"0.00"}},{"$f":"'7_Factores de emisión'!J431","v":"ENERGEA SAVING ENERGY, S.L."},{"$f":"'7_Factores de emisión'!N431","v":{"v":0,"d":"0.00"}},{"$f":"'7_Factores de emisión'!E610","v":"ELEKTRON COMERCIALIZADORA DE ENERGÍA, S.L."},{"$f":"'7_Factores de emisión'!H610","v":{"v":0.23999999463558197,"d":"0.24"}},null,{"$error":"#REF!"},{"$error":"#REF!"}]
[{"$nulls":3},"Inst. fijas","Transp.","Climat.",{"$nulls":14},{"$f":"'7_Factores de emisión'!J308","v":"GENERA ENERGÍA Y TECNOLOGIA, S.L."},{"$f":"'7_Factores de emisión'!N308","v":{"v":0,"d":"0.00"}},{"$f":"'7_Factores de emisión'!E432","v":"GESTERNOVA, S.A."},{"$f":"'7_Factores de emisión'!H432","v":{"v":0,"d":"0.00"}},{"$f":"'7_Factores de emisión'!J432","v":"ENERGÍA NARANJA, S.L."},{"$f":"'7_Factores de emisión'!N432","v":0.25},{"$f":"'7_Factores de emisión'!E611","v":"ELEVA 2 COMERCIALIZADORA, S.L."},{"$f":"'7_Factores de emisión'!H611","v":{"v":0,"d":"0.00"}},null,{"$error":"#REF!"},{"$error":"#REF!"}]
[{"$nulls":3},{"$f":"'6_Resultados'!$H$14","v":0},{"$f":"'6_Resultados'!$H$15","v":0},{"$f":"'6_Resultados'!$H$16","v":0},{"$nulls":14},{"$f":"'7_Factores de emisión'!J309","v":"GOIENER S.COOP"},{"$f":"'7_Factores de emisión'!N309","v":{"v":0,"d":"0.00"}},{"$f":"'7_Factores de emisión'!E433","v":"GIGABUSINESS, S.L."},{"$f":"'7_Factores de emisión'!H433","v":{"v":0,"d":"0.00"}},{"$f":"'7_Factores de emisión'!J433","v":"ENERGY STROM XXI, S.L."},{"$f":"'7_Factores de emisión'!N433","v":{"v":0.20000000298023224,"d":"0.20"}},{"$f":"'7_Factores de emisión'!E612","v":"EMASP, S. COOP."},{"$f":"'7_Factores de emisión'!H612","v":{"v":0,"d":"0.00"}},null,{"$error":"#REF!"},{"$error":"#REF!"}]
[{"$nulls":20},{"$f":"'7_Factores de emisión'!J310","v":"HIDROELÉCTRICA DEL VALIRA, S.L."},{"$f":"'7_Factores de emisión'!N310","v":{"v":0,"d":"0.00"}},{"$f":"'7_Factores de emisión'!E434","v":"GNERA ENERGÍA Y TECNOLOGÍA, S.L."},{"$f":"'7_Factores de emisión'!H434","v":{"v":0,"d":"0.00"}},{"$f":"'7_Factores de emisión'!J434","v":"ENERGY TRADER SOLUTIONS, S.L."},{"$f":"'7_Factores de emisión'!N434","v":{"v":0.4099999964237213,"d":"0.41"}},{"$f":"'7_Factores de emisión'!E613","v":"ENARA GESTIÓN Y MEDIACIÓN, S.L."},{"$f":"'7_Factores de emisión'!H613","v":{"v":0,"d":"0.00"}},null,{"$error":"#REF!"},{"$error":"#REF!"}]
[{"$nulls":3},{"$f":"D248","v":""},{"$f":"E248","v":""},{"$f":"F248","v":""},{"$f":"G248","v":""},{"$nulls":13},{"$f":"'7_Factores de emisión'!J311","v":"HIDROELÉCTRICA EL CARMEN ENERGÍA, S.L."},{"$f":"'7_Factores de emisión'!N311","v":{"v":0,"d":"0.00"}},{"$f":"'7_Factores de emisión'!E435","v":"GOIENER S.COOP"},{"$f":"'7_Factores de emisión'!H435","v":{"v":0,"d":"0.00"}},{"$f":"'7_Factores de emisión'!J435","v":"ENERGÍA NUFRI, S.L.U."},{"$f":"'7_Factores de emisión'!N435","v":{"v":0,"d":"0.00"}},{"$f":"'7_Factores de emisión'!E614","v":"ENDESA ENERGÍA, S.A."},{"$f":"'7_Factores de emisión'!H614","v":{"v":0.27000001072883606,"d":"0.27"}},null,{"$error":"#REF!"},{"$error":"#REF!"}]
[null,null,"Emisiones absolutas (t CO2)",{"$f":"D255","v":{"v":0,"d":"0.0"}},{"$f":"E255","v":{"v":0,"d":"0.0"}},{"$f":"F255","v":{"v":0,"d":"0.0"}},{"$f":"G255","v":{"v":0,"d":"0.0"}},{"$nulls":13},{"$f":"'7_Factores de emisión'!J312","v":"IBERDROLA CLIENTES, S.A.U."},{"$f":"'7_Factores de emisión'!N312","v":{"v":0.15000000596046448,"d":"0.15"}},{"$f":"'7_Factores de emisión'!E436","v":"HIDROELÉCTRICA DEL VALIRA, S.L."},{"$f":"'7_Factores de emisión'!H436","v":{"v":0,"d":"0.00"}},{"$f":"'7_Factores de emisión'!J436","v":"ENERGÍA COLECTIVA, S.L."},{"$f":"'7_Factores de emisión'!N436","v":{"v":0,"d":"0.00"}},{"$f":"'7_Factores de emisión'!E615","v":"ENDESA GENERACIÓN, S.A."},{"$f":"'7_Factores de emisión'!H615","v":{"v":0.3100000023841858,"d":"0.31"}},null,{"$error":"#REF!"},{"$error":"#REF!"}]
[null,null,"Emisiones relativas (t CO2/ud)",{"$f":"D267/D249","v":{"$error":"#DIV/0!"}},{"$f":"E267/E249","v":{"$error":"#DIV/0!"}},{"$f":"F267/F249","v":{"$error":"#DIV/0!"}},{"$f":"G267/G249","v":{"$error":"#DIV/0!"}},{"$nulls":13},{"$f":"'7_Factores de emisión'!J313","v":"INDEXO ENERGÍA, S.L."},{"$f":"'7_Factores de emisión'!N313","v":{"v":0.10999999940395355,"d":"0.11"}},{"$f":"'7_Factores de emisión'!E437","v":"HIDROELÉCTRICA EL CARMEN ENERGÍA, S.L."},{"$f":"'7_Factores de emisión'!H437","v":{"v":0,"d":"0.00"}},{"$f":"'7_Factores de emisión'!J437","v":"ENERGÍA DLR COMERCIALIZADORA, S.L."},{"$f":"'7_Factores de emisión'!N437","v":{"v":0.4099999964237213,"d":"0.41"}},{"$f":"'7_Factores de emisión'!E616","v":"ENDI ENERGY TRADING, S.L."},{"$f":"'7_Factores de emisión'!H616","v":{"v":0,"d":"0.00"}},null,{"$error":"#REF!"},{"$error":"#REF!"}]
[null,null,"Emisiones relativas (t CO2/m2)",{"$f":"D267/D250","v":{"$error":"#DIV/0!"}},{"$f":"E267/E250","v":{"$error":"#DIV/0!"}},{"$f":"F267/F250","v":{"$error":"#DIV/0!"}},{"$f":"G267/G250","v":{"$error":"#DIV/0!"}},{"$nulls":13},{"$f":"'7_Factores de emisión'!J314","v":"INICIATIVA E. NOVA, S.L."},{"$f":"'7_Factores de emisión'!N314","v":{"v":0,"d":"0.00"}},{"$f":"'7_Factores de emisión'!E438","v":"IBERDROLA CLIENTES, S.A.U."},{"$f":"'7_Factores de emisión'!H438","v":{"v":0.2800000011920929,"d":"0.28"}},{"$f":"'7_Factores de emisión'!J438","v":"ENERGÍA ELÉCTRICA EFICIENTE, S.L"},{"$f":"'7_Factores de emisión'!N438","v":{"v":0,"d":"0.00"}},{"$f":"'7_Factores de emisión'!E617","v":"ENELUZ 2025, S.L."},{"$f":"'7_Factores de emisión'!H617","v":{"v":0,"d":"0.00"}},null,{"$error":"#REF!"},{"$error":"#REF!"}]
[null,null,"Emisiones relativas (t CO2/empleado)",{"$f":"D267/D251","v":{"$error":"#DIV/0!"}},{"$f":"E267/E251","v":{"$error":"#DIV/0!"}},{"$f":"F267/F251","v":{"$error":"#DIV/0!"}},{"$f":"G267/G251","v":{"$error":"#DIV/0!"}},{"$nulls":13},{"$f":"'7_Factores de emisión'!J315","v":"INTEGRACIÓN EUROPEA DE ENERGÍA, S.A.U."},{"$f":"'7_Factores de emisión'!N315","v":{"v":0.36000001430511475,"d":"0.36"}},{"$f":"'7_Factores de emisión'!E439","v":"IM3 ENERGÍA, S.L."},{"$f":"'7_Factores de emisión'!H439","v":{"v":0,"d":"0.00"}},{"$f":"'7_Factores de emisión'!J439","v":"ENERKIA ENERGÍA, S.L"},{"$f":"'7_Factores de emisión'!N439","v":{"v":0,"d":"0.00"}},{"$f":"'7_Factores de emisión'!E618","v":"ENERCOLUZ ENERGÍA, S.L."},{"$f":"'7_Factores de emisión'!H618","v":{"v":0.25999999046325684,"d":"0.26"}},null,{"$error":"#REF!"},{"$error":"#REF!"}]
[{"$nulls":20},{"$f":"'7_Factores de emisión'!J316","v":"LA UNION ELECTRO INDUSTRIAL, S.L. \"UNIPERSONAL\""},{"$f":"'7_Factores de emisión'!N316","v":{"v":0,"d":"0.00"}},{"$f":"'7_Factores de emisión'!E440","v":"INDEXO ENERGÍA, S.L."},{"$f":"'7_Factores de emisión'!H440","v":{"v":0.23000000417232513,"d":"0.23"}},{"$f":"'7_Factores de emisión'!J440","v":"ENERPLUS ENERGÍA, S.A."},{"$f":"'7_Factores de emisión'!N440","v":{"v":0.2800000011920929,"d":"0.28"}},{"$f":"'7_Factores de emisión'!E619","v":"ENERGÉTICA DEL ESTE, S.L."},{"$f":"'7_Factores de emisión'!H619","v":{"v":0,"d":"0.00"}},null,{"$error":"#REF!"},{"$error":"#REF!"}]
[null,null,"Evolución",{"$nulls":17},{"$f":"'7_Factores de emisión'!J317","v":"LONJAS TECNOLOGIA, S.A."},{"$f":"'7_Factores de emisión'!N317","v":{"v":0.28999999165534973,"d":"0.29"}},{"$f":"'7_Factores de emisión'!E441","v":"INICIATIVA E. NOVA, S.L."},{"$f":"'7_Factores de emisión'!H441","v":{"v":0.009999999776482582,"d":"0.01"}},{"$f":"'7_Factores de emisión'!J441","v":"ENERPLUS, S.COOP."},{"$f":"'7_Factores de emisión'!N441","v":{"v":0,"d":"0.00"}},{"$f":"'7_Factores de emisión'!E620","v":"ENERGÍA COLECTIVA, S.L."},{"$f":"'7_Factores de emisión'!H620","v":{"v":0,"d":"0.00"}},null,{"$error":"#REF!"},{"$error":"#REF!"}]
[null,null,"Media ratio trienio (a-3, a-2, a-1)",{"$f":"(D268+E268+F268)/3","v":{"$error":"#DIV/0!"}},null,{"$f":"IF(ISNUMBER(D276),\"Se cumple la condición de reducción\",\"No se cumple la condición de reducción\")","v":"No se cumple la condición de reducción"},{"$nulls":14},{"$f":"'7_Factores de emisión'!J318","v":"LUVON ENERGÍA, S.L."},{"$f":"'7_Factores de emisión'!N318","v":{"v":0,"d":"0.00"}},{"$f":"'7_Factores de emisión'!E442","v":"INTEGRACIÓN EUROPEA DE ENERGÍA SUR, S.L."},{"$f":"'7_Factores de emisión'!H442","v":{"v":0.4300000071525574,"d":"0.43"}},{"$f":"'7_Factores de emisión'!J442","v":"ENGIE ESPAÑA, S.L.U."},{"$f":"'7_Factores de emisión'!N442","v":{"v":0.3499999940395355,"d":"0.35"}},{"$f":"'7_Factores de emisión'!E621","v":"ENERGÍA DLR COMERCIALIZADORA, S.L."},{"$f":"'7_Factores de emisión'!H621","v":{"v":0.30000001192092896,"d":"0.30"}},null,{"$error":"#REF!"},{"$error":"#REF!"}]
[null,null,"Media ratio trienio (a-2, a-1, a)",{"$f":"(E268+F268+G268)/3","v":{"$error":"#DIV/0!"}},null,{"$f":"IF(ISNUMBER(D276),\"Reducción de\",\"Incremento de\")","v":"Incremento de"},null,{"$f":"IF(ISNUMBER(D275),D275,D276)","v":{"$error":"#DIV/0!"}},{"$nulls":12},{"$f":"'7_Factores de emisión'!J319","v":"NEXUS ENERGÍA, S.A."},{"$f":"'7_Factores de emisión'!N319","v":{"v":0.019999999552965164,"d":"0.02"}},{"$f":"'7_Factores de emisión'!E443","v":"INTEGRACIÓN EUROPEA DE ENERGÍA, S.A.U."},{"$f":"'7_Factores de emisión'!H443","v":{"v":0.4300000071525574,"d":"0.43"}},{"$f":"'7_Factores de emisión'!J443","v":"ENSTROGA, S.L."},{"$f":"'7_Factores de emisión'!N443","v":{"v":0.4000000059604645,"d":"0.40"}},{"$f":"'7_Factores de emisión'!E622","v":"ENERGÍA ELÉCTRICA EFICIENTE, S.L"},{"$f":"'7_Factores de emisión'!H622","v":{"v":0,"d":"0.00"}},null,{"$error":"#REF!"},{"$error":"#REF!"}]
[null,null,"Aumento",{"$f":"IF(D274-D273>0,(D274-D273)/D273,\"\")","v":{"$error":"#DIV/0!"}},null,{"$f":"$D$274-$D$273","v":{"$error":"#DIV/0!"}},{"$nulls":14},{"$f":"'7_Factores de emisión'!J320","v":"NEXUS RENOVABLES, S.L."},{"$f":"'7_Factores de emisión'!N320","v":{"v":0,"d":"0.00"}},{"$f":"'7_Factores de emisión'!E444","v":"KILOWATIOS VERDES, S.L."},{"$f":"'7_Factores de emisión'!H444","v":{"v":0.11999999731779099,"d":"0.12"}},{"$f":"'7_Factores de emisión'!J444","v":"ENÉRGYA VM GESTIÓN DE ENERGÍA, S.L.U."},{"$f":"'7_Factores de emisión'!N444","v":{"v":0.14000000059604645,"d":"0.14"}},{"$f":"'7_Factores de emisión'!E623","v":"ENERGÍA NARANJA, S.L."},{"$f":"'7_Factores de emisión'!H623","v":{"v":0,"d":"0.00"}},null,{"$error":"#REF!"},{"$error":"#REF!"}]
[null,null,"Reducción",{"$f":"IF(D273-D274>0,(D273-D274)/D273,\"\")","v":{"$error":"#DIV/0!"}},{"$nulls":16},{"$f":"'7_Factores de emisión'!J321","v":"NINOBE SERVICIOS ENERGÉTICOS, S.L."},{"$f":"'7_Factores de emisión'!N321","v":{"v":0.27000001072883606,"d":"0.27"}},{"$f":"'7_Factores de emisión'!E445","v":"LA UNIÓN ELECTRO INDUSTRIAL, S.L.U."},{"$f":"'7_Factores de emisión'!H445","v":{"v":0,"d":"0.00"}},{"$f":"'7_Factores de emisión'!J445","v":"EPRESA ENERGÍA, S.A.U."},{"$f":"'7_Factores de emisión'!N445","v":{"v":0,"d":"0.00"}},{"$f":"'7_Factores de emisión'!E624","v":"ENERGÍA NUFRI, S.L.U."},{"$f":"'7_Factores de emisión'!H624","v":{"v":0.25999999046325684,"d":"0.26"}},null,{"$error":"#REF!"},{"$error":"#REF!"}]
[{"$nulls":20},{"$f":"'7_Factores de emisión'!J322","v":"NOBE SOLUCIONES Y ENERGÍA"},{"$f":"'7_Factores de emisión'!N322","v":{"v":0,"d":"0.00"}},{"$f":"'7_Factores de emisión'!E446","v":"LONJAS TECNOLOGIA, S.A."},{"$f":"'7_Factores de emisión'!H446","v":{"v":0.3100000023841858,"d":"0.31"}},{"$f":"'7_Factores de emisión'!J446","v":"ESTABANELL Y PAHISA MERCATOR, S.A."},{"$f":"'7_Factores de emisión'!N446","v":{"v":0,"d":"0.00"}},{"$f":"'7_Factores de emisión'!E625","v":"ENERGÍA VIVA SPAIN, S.L."},{"$f":"'7_Factores de emisión'!H625","v":{"v":0.27000001072883606,"d":"0.27"}},null,{"$error":"#REF!"},{"$error":"#REF!"}]
[{"$nulls":20},{"$f":"'7_Factores de emisión'!J323","v":"NOSA ENERXIA SOCIEDADE COOP GALEGA"},{"$f":"'7_Factores de emisión'!N323","v":{"v":0,"d":"0.00"}},{"$f":"'7_Factores de emisión'!E447","v":"LUBALOO, S.L."},{"$f":"'7_Factores de emisión'!H447","v":{"v":0,"d":"0.00"}},{"$f":"'7_Factores de emisión'!J447","v":"ESTRATEGIAS ELÉCTRICAS INTEGRALES, S.A."},{"$f":"'7_Factores de emisión'!N447","v":{"v":0.07999999821186066,"d":"0.08"}},{"$f":"'7_Factores de emisión'!E626","v":"ENERGY STROM XXI, S.L."},{"$f":"'7_Factores de emisión'!H626","v":{"v":0.10000000149011612,"d":"0.10"}},null,{"$error":"#REF!"},{"$error":"#REF!"}]
[{"$nulls":20},{"$f":"'7_Factores de emisión'!J324","v":"ODF ENERGÍA LIBRE COMERCIALIZADORA, S.L."},{"$f":"'7_Factores de emisión'!N324","v":{"v":0,"d":"0.00"}},{"$f":"'7_Factores de emisión'!E448","v":"NABALIA ENERGÍA 2000, S.A."},{"$f":"'7_Factores de emisión'!H448","v":{"v":0.3400000035762787,"d":"0.34"}},{"$f":"'7_Factores de emisión'!J448","v":"EVERGREEN ELÉCTRICA, S.L."},{"$f":"'7_Factores de emisión'!N448","v":{"v":0.4000000059604645,"d":"0.40"}},{"$f":"'7_Factores de emisión'!E627","v":"ENÉRGYA VM GESTIÓN DE ENERGÍA, S.L.U."},{"$f":"'7_Factores de emisión'!H627","v":{"v":0.17000000178813934,"d":"0.17"}},null,{"$error":"#REF!"},{"$error":"#REF!"}]
[{"$nulls":5},"Celda vacía",{"$nulls":14},{"$f":"'7_Factores de emisión'!J325","v":"ON DEMAND FACILITIES, S.L.U."},{"$f":"'7_Factores de emisión'!N325","v":{"v":0,"d":"0.00"}},{"$f":"'7_Factores de emisión'!E449","v":"NEXUS ENERGÍA, S.A."},{"$f":"'7_Factores de emisión'!H449","v":{"v":0,"d":"0.00"}},{"$f":"'7_Factores de emisión'!J449","v":"FACTOR ENERGÍA, S.A."},{"$f":"'7_Factores de emisión'!N449","v":{"v":0.2800000011920929,"d":"0.28"}},{"$f":"'7_Factores de emisión'!E628","v":"ENERPLUS, S.COOP."},{"$f":"'7_Factores de emisión'!H628","v":{"v":0,"d":"0.00"}},null,{"$error":"#REF!"},{"$error":"#REF!"}]
[{"$nulls":20},{"$f":"'7_Factores de emisión'!J326","v":"PEPEENERGY"},{"$f":"'7_Factores de emisión'!N326","v":{"v":0,"d":"0.00"}},{"$f":"'7_Factores de emisión'!E450","v":"NINOBE SERVICIOS ENERGÉTICOS, S.L."},{"$f":"'7_Factores de emisión'!H450","v":{"v":0.4000000059604645,"d":"0.40"}},{"$f":"'7_Factores de emisión'!J450","v":"FENIE ENERGÍA, S.A."},{"$f":"'7_Factores de emisión'!N450","v":{"v":0,"d":"0.00"}},{"$f":"'7_Factores de emisión'!E629","v":"ENGIE ESPAÑA, S.L.U."},{"$f":"'7_Factores de emisión'!H629","v":{"v":0.25999999046325684,"d":"0.26"}},null,{"$error":"#REF!"},{"$error":"#REF!"}]
[{"$nulls":20},{"$f":"'7_Factores de emisión'!J327","v":"PETRONIEVES ENERGÍA 1, S.L."},{"$f":"'7_Factores de emisión'!N327","v":{"v":0.25999999046325684,"d":"0.26"}},{"$f":"'7_Factores de emisión'!E451","v":"NOBE SOLUCIONES Y ENERGÍA"},{"$f":"'7_Factores de emisión'!H451","v":{"v":0,"d":"0.00"}},{"$f":"'7_Factores de emisión'!J451","v":"FOENER COMERCIALIZACIÓN, S.L.U."},{"$f":"'7_Factores de emisión'!N451","v":{"v":0.36000001430511475,"d":"0.36"}},{"$f":"'7_Factores de emisión'!E630","v":"ENSTROGA, S.L."},{"$f":"'7_Factores de emisión'!H630","v":{"v":0.30000001192092896,"d":"0.30"}},null,{"$error":"#REF!"},{"$error":"#REF!"}]
[null,null,"Resultados por sedes",{"$nulls":17},{"$f":"'7_Factores de emisión'!J328","v":"PHOTON GESTION"},{"$f":"'7_Factores de emisión'!N328","v":{"v":0,"d":"0.00"}},{"$f":"'7_Factores de emisión'!E452","v":"NOSA ENERXIA SOCIEDADE COOP GALEGA"},{"$f":"'7_Factores de emisión'!H452","v":{"v":0,"d":"0.00"}},{"$f":"'7_Factores de emisión'!J452","v":"FORZA VSUNAIR, S.L."},{"$f":"'7_Factores de emisión'!N452","v":{"v":0.09000000357627869,"d":"0.09"}},{"$f":"'7_Factores de emisión'!E631","v":"ESTABANELL Y PAHISA MERCATOR, S.A."},{"$f":"'7_Factores de emisión'!H631","v":{"v":0,"d":"0.00"}},null,{"$error":"#REF!"},{"$error":"#REF!"}]
[{"$nulls":20},{"$f":"'7_Factores de emisión'!J329","v":"PROT ENERGÍA COMERCIALIZACIÓN, S.L."},{"$f":"'7_Factores de emisión'!N329","v":{"v":0,"d":"0.00"}},{"$f":"'7_Factores de emisión'!E453","v":"NUEVA COMERCIALIZADORA ESPAÑOLA, S.L."},{"$f":"'7_Factores de emisión'!H453","v":{"v":0.4000000059604645,"d":"0.40"}},{"$f":"'7_Factores de emisión'!J453","v":"FUSIONA COMERCIALIZADORA, S.A."},{"$f":"'7_Factores de emisión'!N453","v":{"v":0,"d":"0.00"}},{"$f":"'7_Factores de emisión'!E632","v":"ESTRATEGIAS ELÉCTRICAS INTEGRALES, S.A."},{"$f":"'7_Factores de emisión'!H632","v":{"v":0.17000000178813934,"d":"0.17"}},null,{"$error":"#REF!"},{"$error":"#REF!"}]
[null,null,"Nombre sede ","Nombres únicos","Unión nombres únicos",{"$nulls":15},{"$f":"'7_Factores de emisión'!J330","v":"PULSAR SERVICIOS ENERGÉTICOS,"},{"$f":"'7_Factores de emisión'!N330","v":{"v":0,"d":"0.00"}},{"$f":"'7_Factores de emisión'!E454","v":"ODF ENERGÍA LIBRE COMERCIALIZADORA, S.L."},{"$f":"'7_Factores de emisión'!H454","v":{"v":0,"d":"0.00"}},{"$f":"'7_Factores de emisión'!J454","v":"GALP ENERGÍA ESPAÑA S.A.U."},{"$f":"'7_Factores de emisión'!N454","v":{"v":0.3499999940395355,"d":"0.35"}},{"$f":"'7_Factores de emisión'!E633","v":"EVERGREEN ELÉCTRICA, S.L."},{"$f":"'7_Factores de emisión'!H633","v":{"v":0.3100000023841858,"d":"0.31"}},null,{"$error":"#REF!"},{"$error":"#REF!"}]
[null,null,{"$f":"IF('2_Combustibles fósiles'!E18=\"\",\"\",'2_Combustibles fósiles'!E18)","v":""},{"$f":"INDEX($C$286:$C$351,MATCH(0,INDEX(COUNTIF($D$285:D285,$C$286:$C$351),),))","v":""},{"$f":"IF(D286=\"\",D287,IF(D286=$F$281,D287,D286))","v":{"$error":"#N/A"}},"No extender",{"$nulls":14},{"$f":"'7_Factores de emisión'!J331","v":"RENEWABLE VENTURES, S.L."},{"$f":"'7_Factores de emisión'!N331","v":{"v":0,"d":"0.00"}},{"$f":"'7_Factores de emisión'!E455","v":"ON DEMAND FACILITIES, S.L.U."},{"$f":"'7_Factores de emisión'!H455","v":{"v":0.05999999865889549,"d":"0.06"}},{"$f":"'7_Factores de emisión'!J455","v":"GAOLANIA SERVICIOS, S.L."},{"$f":"'7_Factores de emisión'!N455","v":{"v":0,"d":"0.00"}},{"$f":"'7_Factores de emisión'!E634","v":"FACTOR ENERGÍA, S.A."},{"$f":"'7_Factores de emisión'!H634","v":{"v":0.20999999344348907,"d":"0.21"}},null,{"$error":"#REF!"},{"$error":"#REF!"}]
[null,null,{"$f":"IF('2_Combustibles fósiles'!E19=\"\",\"\",'2_Combustibles fósiles'!E19)","v":""},{"$f":"INDEX($C$286:$C$351,MATCH(0,INDEX(COUNTIF($D$285:D286,$C$286:$C$351),),))","v":{"$error":"#N/A"}},{"$f":"IF(D287=\"\",D288,IF(D287=E286,D288,D287))","v":{"$error":"#N/A"}},"Extender desde aquí",{"$nulls":14},{"$f":"'7_Factores de emisión'!J332","v":"REYSE ENERGÍA, S.L."},{"$f":"'7_Factores de emisión'!N332","v":{"v":0.07000000029802322,"d":"0.07"}},{"$f":"'7_Factores de emisión'!E456","v":"PEPEENERGY"},{"$f":"'7_Factores de emisión'!H456","v":{"v":0,"d":"0.00"}},{"$f":"'7_Factores de emisión'!J456","v":"GAS NATURAL COMERCIALIZADORA, S.A."},{"$f":"'7_Factores de emisión'!N456","v":0.25},{"$f":"'7_Factores de emisión'!E635","v":"FAIN Energía S.L."},{"$f":"'7_Factores de emisión'!H635","v":{"v":0,"d":"0.00"}},null,{"$error":"#REF!"},{"$error":"#REF!"}]
[null,null,{"$f":"IF('2_Combustibles fósiles'!E20=\"\",\"\",'2_Combustibles fósiles'!E20)","v":""},{"$f":"INDEX($C$286:$C$351,MATCH(0,INDEX(COUNTIF($D$285:D287,$C$286:$C$351),),))","v":{"$error":"#N/A"}},{"$f":"IF(D288=\"\",D289,IF(D288=E287,D289,D288))","v":{"$error":"#N/A"}},{"$nulls":15},{"$f":"'7_Factores de emisión'!J333","v":"RONDA OESTE ENERGÍA, S.L."},{"$f":"'7_Factores de emisión'!N333","v":{"v":0,"d":"0.00"}},{"$f":"'7_Factores de emisión'!E457","v":"PETRO NAVARRA, S.L."},{"$f":"'7_Factores de emisión'!H457","v":{"v":0,"d":"0.00"}},{"$f":"'7_Factores de emisión'!J457","v":"GAS NATURAL FENOSA RENOVABLES, S.L.U."},{"$f":"'7_Factores de emisión'!N457","v":{"v":0,"d":"0.00"}},{"$f":"'7_Factores de emisión'!E636","v":"FENIE ENERGÍA, S.A."},{"$f":"'7_Factores de emisión'!H636","v":{"v":0,"d":"0.00"}},null,{"$error":"#REF!"},{"$error":"#REF!"}]
[null,null,{"$f":"IF('2_Combustibles fósiles'!E21=\"\",\"\",'2_Combustibles fósiles'!E21)","v":""},{"$f":"INDEX($C$286:$C$351,MATCH(0,INDEX(COUNTIF($D$285:D288,$C$286:$C$351),),))","v":{"$error":"#N/A"}},{"$f":"IF(D289=\"\",D290,IF(D289=E288,D290,D289))","v":{"$error":"#N/A"}},{"$nulls":15},{"$f":"'7_Factores de emisión'!J334","v":"SAMPOL INGENIERÍA Y OBRAS, S.A."},{"$f":"'7_Factores de emisión'!N334","v":{"v":0.30000001192092896,"d":"0.30"}},{"$f":"'7_Factores de emisión'!E458","v":"PETRONIEVES ENERGÍA 1, S.L."},{"$f":"'7_Factores de emisión'!H458","v":{"v":0.38999998569488525,"d":"0.39"}},{"$f":"'7_Factores de emisión'!J458","v":"GAS NATURAL SERVICIOS SDG, S.A."},{"$f":"'7_Factores de emisión'!N458","v":{"v":0.4099999964237213,"d":"0.41"}},{"$f":"'7_Factores de emisión'!E637","v":"Foener Energía, S.L"},{"$f":"'7_Factores de emisión'!H637","v":{"v":0.2800000011920929,"d":"0.28"}},null,{"$error":"#REF!"},{"$error":"#REF!"}]
[null,null,{"$f":"IF('2_Combustibles fósiles'!E22=\"\",\"\",'2_Combustibles fósiles'!E22)","v":""},{"$f":"INDEX($C$286:$C$351,MATCH(0,INDEX(COUNTIF($D$285:D289,$C$286:$C$351),),))","v":{"$error":"#N/A"}},{"$error":"#N/A"},{"$nulls":15},{"$f":"'7_Factores de emisión'!J335","v":"SOM ENERGÍA, S.C.C.L."},{"$f":"'7_Factores de emisión'!N335","v":{"v":0,"d":"0.00"}},{"$f":"'7_Factores de emisión'!E459","v":"PHOTON GESTIÓN"},{"$f":"'7_Factores de emisión'!H459","v":{"v":0,"d":"0.00"}},{"$f":"'7_Factores de emisión'!J459","v":"GEO ALTERNATIVA, S.L."},{"$f":"'7_Factores de emisión'!N459","v":{"v":0,"d":"0.00"}},{"$f":"'7_Factores de emisión'!E638","v":"FORZA VSUNAIR, S.L."},{"$f":"'7_Factores de emisión'!H638","v":{"v":0,"d":"0.00"}},null,{"$error":"#REF!"},{"$error":"#REF!"}]
[null,null,{"$f":"IF('2_Combustibles fósiles'!E23=\"\",\"\",'2_Combustibles fósiles'!E23)","v":""},{"$f":"INDEX($C$286:$C$351,MATCH(0,INDEX(COUNTIF($D$285:D290,$C$286:$C$351),),))","v":{"$error":"#N/A"}},{"$error":"#N/A"},{"$nulls":15},{"$f":"'7_Factores de emisión'!J336","v":"SUMINISTROS ESPECIALES ALGINETENSES COOP. V."},{"$f":"'7_Factores de emisión'!N336","v":{"v":0,"d":"0.00"}},{"$f":"'7_Factores de emisión'!E460","v":"PROT ENERGÍA COMERCIALIZACIÓN, S.L."},{"$f":"'7_Factores de emisión'!H460","v":{"v":0,"d":"0.00"}},{"$f":"'7_Factores de emisión'!J460","v":"GEOATLANTER, S.L."},{"$f":"'7_Factores de emisión'!N460","v":{"v":0,"d":"0.00"}},{"$f":"'7_Factores de emisión'!E639","v":"FOX ENERGÍA, S.A."},{"$f":"'7_Factores de emisión'!H639","v":{"v":0.3100000023841858,"d":"0.31"}},null,{"$error":"#REF!"},{"$error":"#REF!"}]
[null,null,{"$f":"IF('2_Combustibles fósiles'!E24=\"\",\"\",'2_Combustibles fósiles'!E24)","v":""},{"$f":"INDEX($C$286:$C$351,MATCH(0,INDEX(COUNTIF($D$285:D291,$C$286:$C$351),),))","v":{"$error":"#N/A"}},{"$error":"#N/A"},{"$nulls":15},{"$f":"'7_Factores de emisión'!J337","v":"SUNAIR ONE ENERGY, S.L."},{"$f":"'7_Factores de emisión'!N337","v":{"v":0.3100000023841858,"d":"0.31"}},{"$f":"'7_Factores de emisión'!E461","v":"PULSAR SERVICIOS ENERGÉTICOS, S.L."},{"$f":"'7_Factores de emisión'!H461","v":{"v":0,"d":"0.00"}},{"$f":"'7_Factores de emisión'!J461","v":"GERENTA ENERGÍA, S.L.U"},{"$f":"'7_Factores de emisión'!N461","v":{"v":0,"d":"0.00"}},{"$f":"'7_Factores de emisión'!E640","v":"FUSIONA COMERCIALIZADORA, S.A."},{"$f":"'7_Factores de emisión'!H640","v":{"v":0,"d":"0.00"}},null,{"$error":"#REF!"},{"$error":"#REF!"}]
[null,null,{"$f":"IF('2_Combustibles fósiles'!E25=\"\",\"\",'2_Combustibles fósiles'!E25)","v":""},{"$f":"INDEX($C$286:$C$351,MATCH(0,INDEX(COUNTIF($D$285:D292,$C$286:$C$351),),))","v":{"$error":"#N/A"}},{"$error":"#N/A"},{"$nulls":15},{"$f":"'7_Factores de emisión'!J338","v":"SYDER COMERCIALIZADORA VERDE, S.L."},{"$f":"'7_Factores de emisión'!N338","v":{"v":0,"d":"0.00"}},{"$f":"'7_Factores de emisión'!E462","v":"RENEWABLE VENTURES, S.L."},{"$f":"'7_Factores de emisión'!H462","v":{"v":0,"d":"0.00"}},{"$f":"'7_Factores de emisión'!J462","v":"GESTERNOVA, S.A."},{"$f":"'7_Factores de emisión'!N462","v":{"v":0,"d":"0.00"}},{"$f":"'7_Factores de emisión'!E641","v":"GAIA GLOBAL ENERGY SOCIEDAD LIMITADA"},{"$f":"'7_Factores de emisión'!H641","v":{"v":0,"d":"0.00"}},null,{"$error":"#REF!"},{"$error":"#REF!"}]
[null,null,{"$f":"IF('2_Combustibles fósiles'!E26=\"\",\"\",'2_Combustibles fósiles'!E26)","v":""},{"$f":"INDEX($C$286:$C$351,MATCH(0,INDEX(COUNTIF($D$285:D293,$C$286:$C$351),),))","v":{"$error":"#N/A"}},{"$error":"#N/A"},{"$nulls":15},{"$f":"'7_Factores de emisión'!J339","v":"TELEFÓNICA SOLUCIONES DE INFORMÁTICA Y COMUNICACIONES DE ESPAÑA, S.A.U."},{"$f":"'7_Factores de emisión'!N339","v":{"v":0,"d":"0.00"}},{"$f":"'7_Factores de emisión'!E463","v":"SAMPOL INGENIERÍA Y OBRAS, S.A."},{"$f":"'7_Factores de emisión'!H463","v":{"v":0.3199999928474426,"d":"0.32"}},{"$f":"'7_Factores de emisión'!J463","v":"GLOBAL BIOSFERA PROTEC, S.L."},{"$f":"'7_Factores de emisión'!N463","v":{"v":0,"d":"0.00"}},{"$f":"'7_Factores de emisión'!E642","v":"GALP ENERGÍA ESPAÑA S.A.U."},{"$f":"'7_Factores de emisión'!H642","v":{"v":0.27000001072883606,"d":"0.27"}},null,{"$error":"#REF!"},{"$error":"#REF!"}]
[null,null,{"$f":"IF('2_Combustibles fósiles'!E27=\"\",\"\",'2_Combustibles fósiles'!E27)","v":""},{"$f":"INDEX($C$286:$C$351,MATCH(0,INDEX(COUNTIF($D$285:D294,$C$286:$C$351),),))","v":{"$error":"#N/A"}},{"$error":"#N/A"},{"$nulls":15},{"$f":"'7_Factores de emisión'!J340","v":"THE YELLOW ENERGY, S.L."},{"$f":"'7_Factores de emisión'!N340","v":{"v":0,"d":"0.00"}},{"$f":"'7_Factores de emisión'!E464","v":"SOM ENERGÍA, S.C.C.L."},{"$f":"'7_Factores de emisión'!H464","v":{"v":0,"d":"0.00"}},{"$f":"'7_Factores de emisión'!J464","v":"GNERA ENERGÍA Y TECNOLOGIA, S.L."},{"$f":"'7_Factores de emisión'!N464","v":{"v":0,"d":"0.00"}},{"$f":"'7_Factores de emisión'!E643","v":"GAOLANIA SERVICIOS, S.L."},{"$f":"'7_Factores de emisión'!H643","v":{"v":0,"d":"0.00"}},null,{"$error":"#REF!"},{"$error":"#REF!"}]
[null,null,{"$f":"IF('2_Combustibles fósiles'!E28=\"\",\"\",'2_Combustibles fósiles'!E28)","v":""},{"$f":"INDEX($C$286:$C$351,MATCH(0,INDEX(COUNTIF($D$285:D295,$C$286:$C$351),),))","v":{"$error":"#N/A"}},{"$error":"#N/A"},{"$nulls":15},{"$f":"'7_Factores de emisión'!J341","v":"TRADE UNIVERSAL ENERGY, S.A."},{"$f":"'7_Factores de emisión'!N341","v":{"v":0,"d":"0.00"}},{"$f":"'7_Factores de emisión'!E465","v":"SUMINISTRADORA ELÉCTRICA VIENTOS ALISIOS DE LANZAROTE, S.L."},{"$f":"'7_Factores de emisión'!H465","v":{"v":0,"d":"0.00"}},{"$f":"'7_Factores de emisión'!J465","v":"GOIENER S.COOP"},{"$f":"'7_Factores de emisión'!N465","v":{"v":0,"d":"0.00"}},{"$f":"'7_Factores de emisión'!E644","v":"GAS NATURAL COMERCIALIZADORA, S.A."},{"$f":"'7_Factores de emisión'!H644","v":{"v":0.20999999344348907,"d":"0.21"}},null,{"$error":"#REF!"},{"$error":"#REF!"}]
[null,null,{"$f":"IF('2_Combustibles fósiles'!E29=\"\",\"\",'2_Combustibles fósiles'!E29)","v":""},{"$f":"INDEX($C$286:$C$351,MATCH(0,INDEX(COUNTIF($D$285:D296,$C$286:$C$351),),))","v":{"$error":"#N/A"}},{"$error":"#N/A"},{"$nulls":15},{"$f":"'7_Factores de emisión'!J342","v":"UNIC GLOBAL-LOGISTICS S.L."},{"$f":"'7_Factores de emisión'!N342","v":{"v":0,"d":"0.00"}},{"$f":"'7_Factores de emisión'!E466","v":"SUMINISTROS ESPECIALES ALGINETENSES COOP. V."},{"$f":"'7_Factores de emisión'!H466","v":{"v":0,"d":"0.00"}},{"$f":"'7_Factores de emisión'!J466","v":"GRUPO IBERSOGAS ENERGÍA, S.L."},{"$f":"'7_Factores de emisión'!N466","v":{"v":0.4099999964237213,"d":"0.41"}},{"$f":"'7_Factores de emisión'!E645","v":"GEO ALTERNATIVA, S.L."},{"$f":"'7_Factores de emisión'!H645","v":{"v":0,"d":"0.00"}},null,{"$error":"#REF!"},{"$error":"#REF!"}]
[null,null,{"$f":"IF('2_Combustibles fósiles'!E30=\"\",\"\",'2_Combustibles fósiles'!E30)","v":""},{"$f":"INDEX($C$286:$C$351,MATCH(0,INDEX(COUNTIF($D$285:D297,$C$286:$C$351),),))","v":{"$error":"#N/A"}},{"$error":"#N/A"},{"$nulls":15},{"$f":"'7_Factores de emisión'!J343","v":"UNIELÉCTRICA ENERGÍA, S.A."},{"$f":"'7_Factores de emisión'!N343","v":{"v":0,"d":"0.00"}},{"$f":"'7_Factores de emisión'!E467","v":"SWAP ENERGÍA, S.A."},{"$f":"'7_Factores de emisión'!H467","v":{"v":0.38999998569488525,"d":"0.39"}},{"$f":"'7_Factores de emisión'!J467","v":"HELIA COOP V"},{"$f":"'7_Factores de emisión'!N467","v":{"v":0,"d":"0.00"}},{"$f":"'7_Factores de emisión'!E646","v":"GEOATLANTER, S.L."},{"$f":"'7_Factores de emisión'!H646","v":{"v":0,"d":"0.00"}},null,{"$error":"#REF!"},{"$error":"#REF!"}]
[null,null,{"$f":"IF('2_Combustibles fósiles'!E31=\"\",\"\",'2_Combustibles fósiles'!E31)","v":""},{"$f":"INDEX($C$286:$C$351,MATCH(0,INDEX(COUNTIF($D$285:D298,$C$286:$C$351),),))","v":{"$error":"#N/A"}},{"$error":"#N/A"},{"$nulls":15},{"$f":"'7_Factores de emisión'!J344","v":"V3J INGENIERIA Y SERVICIOS, S.L."},{"$f":"'7_Factores de emisión'!N344","v":{"v":0.2800000011920929,"d":"0.28"}},{"$f":"'7_Factores de emisión'!E468","v":"SYDER COMERCIALIZADORA VERDE, S.L."},{"$f":"'7_Factores de emisión'!H468","v":{"v":0,"d":"0.00"}},{"$f":"'7_Factores de emisión'!J468","v":"HELIOELEC ENERGÍA ELECTRICA, S.L."},{"$f":"'7_Factores de emisión'!N468","v":{"v":0,"d":"0.00"}},{"$f":"'7_Factores de emisión'!E647","v":"GERENTA ENERGÍA, S.L.U"},{"$f":"'7_Factores de emisión'!H647","v":{"v":0,"d":"0.00"}},null,{"$error":"#REF!"},{"$error":"#REF!"}]
[null,null,{"$f":"IF('2_Combustibles fósiles'!E32=\"\",\"\",'2_Combustibles fósiles'!E32)","v":""},{"$f":"INDEX($C$286:$C$351,MATCH(0,INDEX(COUNTIF($D$285:D299,$C$286:$C$351),),))","v":{"$error":"#N/A"}},{"$error":"#N/A"},{"$nulls":15},{"$f":"'7_Factores de emisión'!J345","v":"VIESGO ENERGíA, S.L."},{"$f":"'7_Factores de emisión'!N345","v":{"v":0.25999999046325684,"d":"0.26"}},{"$f":"'7_Factores de emisión'!E469","v":"TELEFÓNICA SOLUCIONES DE INFORMÁTICA Y COMUNICACIONES DE ESPAÑA, S.A.U."},{"$f":"'7_Factores de emisión'!H469","v":{"v":0,"d":"0.00"}},{"$f":"'7_Factores de emisión'!J469","v":"HIDROELECTRICA DEL VALIRA, S.L."},{"$f":"'7_Factores de emisión'!N469","v":{"v":0,"d":"0.00"}},{"$f":"'7_Factores de emisión'!E648","v":"GESTERNOVA, S.A."},{"$f":"'7_Factores de emisión'!H648","v":{"v":0,"d":"0.00"}},null,{"$error":"#REF!"},{"$error":"#REF!"}]
[null,null,{"$f":"IF('2_Combustibles fósiles'!E33=\"\",\"\",'2_Combustibles fósiles'!E33)","v":""},{"$f":"INDEX($C$286:$C$351,MATCH(0,INDEX(COUNTIF($D$285:D300,$C$286:$C$351),),))","v":{"$error":"#N/A"}},{"$error":"#N/A"},{"$nulls":15},{"$f":"'7_Factores de emisión'!J346","v":"WATIUM, S.L."},{"$f":"'7_Factores de emisión'!N346","v":{"v":0,"d":"0.00"}},{"$f":"'7_Factores de emisión'!E470","v":"THE YELLOW ENERGY, S.L."},{"$f":"'7_Factores de emisión'!H470","v":{"v":0,"d":"0.00"}},{"$f":"'7_Factores de emisión'!J470","v":"HIDROELÉCTRICA EL CARMEN ENERGÍA, S.L."},{"$f":"'7_Factores de emisión'!N470","v":{"v":0,"d":"0.00"}},{"$f":"'7_Factores de emisión'!E649","v":"GLOBAL BIOSFERA PROTEC, S.L."},{"$f":"'7_Factores de emisión'!H649","v":{"v":0,"d":"0.00"}},null,{"$error":"#REF!"},{"$error":"#REF!"}]
[null,null,{"$f":"IF('2_Combustibles fósiles'!E34=\"\",\"\",'2_Combustibles fósiles'!E34)","v":""},{"$f":"INDEX($C$286:$C$351,MATCH(0,INDEX(COUNTIF($D$285:D301,$C$286:$C$351),),))","v":{"$error":"#N/A"}},{"$error":"#N/A"},{"$nulls":15},{"$f":"'7_Factores de emisión'!J347","v":"WIND TO MARKET, S.A."},{"$f":"'7_Factores de emisión'!N347","v":{"v":0,"d":"0.00"}},{"$f":"'7_Factores de emisión'!E471","v":"TRADE UNIVERSAL ENERGY, S.A."},{"$f":"'7_Factores de emisión'!H471","v":{"v":0,"d":"0.00"}},{"$f":"'7_Factores de emisión'!J471","v":"IBERDROLA CLIENTES, S.A.U."},{"$f":"'7_Factores de emisión'!N471","v":{"v":0.27000001072883606,"d":"0.27"}},{"$f":"'7_Factores de emisión'!E650","v":"GLOBELIGHT ENERGY S.L"},{"$f":"'7_Factores de emisión'!H650","v":{"v":0.2199999988079071,"d":"0.22"}},null,{"$error":"#REF!"},{"$error":"#REF!"}]
[null,null,{"$f":"IF('2_Combustibles fósiles'!E35=\"\",\"\",'2_Combustibles fósiles'!E35)","v":""},{"$f":"INDEX($C$286:$C$351,MATCH(0,INDEX(COUNTIF($D$285:D302,$C$286:$C$351),),))","v":{"$error":"#N/A"}},{"$error":"#N/A"},{"$nulls":15},{"$f":"'7_Factores de emisión'!J348","v":"ZENCER, S. COOP. AND"},{"$f":"'7_Factores de emisión'!N348","v":{"v":0,"d":"0.00"}},{"$f":"'7_Factores de emisión'!E472","v":"UNIELÉCTRICA ENERGÍA, S.A."},{"$f":"'7_Factores de emisión'!H472","v":{"v":0,"d":"0.00"}},{"$f":"'7_Factores de emisión'!J472","v":"IBERDROLA GENERACION ESPAÑA, S.A.U."},{"$f":"'7_Factores de emisión'!N472","v":{"v":0,"d":"0.00"}},{"$f":"'7_Factores de emisión'!E651","v":"GNERA ENERGÍA Y TECNOLOGIA, S.L."},{"$f":"'7_Factores de emisión'!H651","v":{"v":0,"d":"0.00"}},null,{"$error":"#REF!"},{"$error":"#REF!"}]
[null,null,{"$f":"IF('2_Combustibles fósiles'!E36=\"\",\"\",'2_Combustibles fósiles'!E36)","v":""},{"$f":"INDEX($C$286:$C$351,MATCH(0,INDEX(COUNTIF($D$285:D303,$C$286:$C$351),),))","v":{"$error":"#N/A"}},{"$error":"#N/A"},{"$nulls":15},"Varias comercializadoras",{"$f":"'7_Factores de emisión'!J229","v":0.36},{"$f":"'7_Factores de emisión'!E473","v":"V3J INGENIERIA Y SERVICIOS, S.L."},{"$f":"'7_Factores de emisión'!H473","v":{"v":0.3700000047683716,"d":"0.37"}},{"$f":"'7_Factores de emisión'!J473","v":"IBERDROLA SERVICIOS ENERGETICOS, S.A.U."},{"$f":"'7_Factores de emisión'!N473","v":{"v":0,"d":"0.00"}},{"$f":"'7_Factores de emisión'!E652","v":"GOIENER S.COOP"},{"$f":"'7_Factores de emisión'!H652","v":{"v":0,"d":"0.00"}},null,{"$error":"#REF!"},{"$error":"#REF!"}]
[null,null,{"$f":"IF('2_Combustibles fósiles'!E37=\"\",\"\",'2_Combustibles fósiles'!E37)","v":""},{"$f":"INDEX($C$286:$C$351,MATCH(0,INDEX(COUNTIF($D$285:D304,$C$286:$C$351),),))","v":{"$error":"#N/A"}},{"$error":"#N/A"},{"$nulls":15},"Otras",{"$f":"V304","v":0.36},{"$f":"'7_Factores de emisión'!E474","v":"VIESGO ENERGÍA, S.L."},{"$f":"'7_Factores de emisión'!H474","v":{"v":0.3199999928474426,"d":"0.32"}},{"$f":"'7_Factores de emisión'!J474","v":"IBERELECTRICA COMERCIALIZADORA, S.L."},{"$f":"'7_Factores de emisión'!N474","v":{"v":0.4099999964237213,"d":"0.41"}},{"$f":"'7_Factores de emisión'!E653","v":"GRUPO IBERSOGAS ENERGÍA, S.L."},{"$f":"'7_Factores de emisión'!H653","v":{"v":0.3100000023841858,"d":"0.31"}},null,{"$error":"#REF!"},{"$error":"#REF!"}]
[null,null,{"$f":"IF('2_Combustibles fósiles'!E38=\"\",\"\",'2_Combustibles fósiles'!E38)","v":""},{"$f":"INDEX($C$286:$C$351,MATCH(0,INDEX(COUNTIF($D$285:D305,$C$286:$C$351),),))","v":{"$error":"#N/A"}},{"$error":"#N/A"},{"$nulls":17},{"$f":"'7_Factores de emisión'!E475","v":"WATIUM, S.L."},{"$f":"'7_Factores de emisión'!H475","v":{"v":0,"d":"0.00"}},{"$f":"'7_Factores de emisión'!J475","v":"IM3 ENERGÍA, S.L."},{"$f":"'7_Factores de emisión'!N475","v":{"v":0.3100000023841858,"d":"0.31"}},{"$f":"'7_Factores de emisión'!E654","v":"HELIA COOP V"},{"$f":"'7_Factores de emisión'!H654","v":{"v":0,"d":"0.00"}},null,{"$error":"#REF!"},{"$error":"#REF!"}]
[null,null,{"$f":"IF('2_Combustibles fósiles'!E39=\"\",\"\",'2_Combustibles fósiles'!E39)","v":""},{"$f":"INDEX($C$286:$C$351,MATCH(0,INDEX(COUNTIF($D$285:D306,$C$286:$C$351),),))","v":{"$error":"#N/A"}},{"$error":"#N/A"},{"$nulls":17},{"$f":"'7_Factores de emisión'!E476","v":"WIND TO MARKET, S.A."},{"$f":"'7_Factores de emisión'!H476","v":{"v":0.18000000715255737,"d":"0.18"}},{"$f":"'7_Factores de emisión'!J476","v":"INDEXO ENERGÍA, S.L."},{"$f":"'7_Factores de emisión'!N476","v":{"v":0.3100000023841858,"d":"0.31"}},{"$f":"'7_Factores de emisión'!E655","v":"HELIOELEC ENERGÍA ELECTRICA, S.L."},{"$f":"'7_Factores de emisión'!H655","v":{"v":0,"d":"0.00"}},null,{"$error":"#REF!"},{"$error":"#REF!"}]
[null,null,{"$f":"IF('3_Fluorados'!E12=\"\",\"\",'3_Fluorados'!E12)","v":""},{"$f":"INDEX($C$286:$C$351,MATCH(0,INDEX(COUNTIF($D$285:D307,$C$286:$C$351),),))","v":{"$error":"#N/A"}},{"$error":"#N/A"},{"$nulls":17},"Varias comercializadoras",{"$f":"'7_Factores de emisión'!E352","v":0.43},{"$f":"'7_Factores de emisión'!J477","v":"INER ENERGÍA CASTILLA LA MANCHA, S.L."},{"$f":"'7_Factores de emisión'!N477","v":{"v":0.4099999964237213,"d":"0.41"}},{"$f":"'7_Factores de emisión'!E656","v":"HIDROELECTRICA DEL VALIRA, S.L."},{"$f":"'7_Factores de emisión'!H656","v":{"v":0,"d":"0.00"}},null,{"$error":"#REF!"},{"$error":"#REF!"}]
[null,null,{"$f":"IF('3_Fluorados'!E13=\"\",\"\",'3_Fluorados'!E13)","v":""},{"$f":"INDEX($C$286:$C$351,MATCH(0,INDEX(COUNTIF($D$285:D308,$C$286:$C$351),),))","v":{"$error":"#N/A"}},{"$error":"#N/A"},{"$nulls":17},"Otras",{"$f":"X308","v":0.43},{"$f":"'7_Factores de emisión'!J478","v":"INICIATIVA E. NOVA, S.L."},{"$f":"'7_Factores de emisión'!N478","v":{"v":0,"d":"0.00"}},{"$f":"'7_Factores de emisión'!E657","v":"HIDROELÉCTRICA EL CARMEN ENERGÍA, S.L."},{"$f":"'7_Factores de emisión'!H657","v":{"v":0,"d":"0.00"}},null,{"$error":"#REF!"},{"$error":"#REF!"}]
[null,null,{"$f":"IF('3_Fluorados'!E14=\"\",\"\",'3_Fluorados'!E14)","v":""},{"$f":"INDEX($C$286:$C$351,MATCH(0,INDEX(COUNTIF($D$285:D309,$C$286:$C$351),),))","v":{"$error":"#N/A"}},{"$error":"#N/A"},{"$nulls":19},{"$f":"'7_Factores de emisión'!J479","v":"INTEGRACION EUROPEA DE ENERGÍA SUR, S.L."},{"$f":"'7_Factores de emisión'!N479","v":{"v":0.4099999964237213,"d":"0.41"}},{"$f":"'7_Factores de emisión'!E658","v":"IBERCOEN ENERGÍA, S.A."},{"$f":"'7_Factores de emisión'!H658","v":{"v":0,"d":"0.00"}},null,{"$error":"#REF!"},{"$error":"#REF!"}]
[null,null,{"$f":"IF('3_Fluorados'!E15=\"\",\"\",'3_Fluorados'!E15)","v":""},{"$f":"INDEX($C$286:$C$351,MATCH(0,INDEX(COUNTIF($D$285:D310,$C$286:$C$351),),))","v":{"$error":"#N/A"}},{"$error":"#N/A"},{"$nulls":19},{"$f":"'7_Factores de emisión'!J480","v":"INTEGRACIÓN EUROPEA DE ENERGÍA, S.A.U."},{"$f":"'7_Factores de emisión'!N480","v":{"v":0.4099999964237213,"d":"0.41"}},{"$f":"'7_Factores de emisión'!E659","v":"IBERDROLA CLIENTES, S.A.U."},{"$f":"'7_Factores de emisión'!H659","v":{"v":0.20000000298023224,"d":"0.20"}},null,{"$error":"#REF!"},{"$error":"#REF!"}]
[null,null,{"$f":"IF('3_Fluorados'!E16=\"\",\"\",'3_Fluorados'!E16)","v":""},{"$f":"INDEX($C$286:$C$351,MATCH(0,INDEX(COUNTIF($D$285:D311,$C$286:$C$351),),))","v":{"$error":"#N/A"}},{"$error":"#N/A"},{"$nulls":19},{"$f":"'7_Factores de emisión'!J481","v":"KILOWATIOS VERDES, S.L."},{"$f":"'7_Factores de emisión'!N481","v":{"v":0.009999999776482582,"d":"0.01"}},{"$f":"'7_Factores de emisión'!E660","v":"IBERDROLA GENERACION ESPAÑA, S.A.U."},{"$f":"'7_Factores de emisión'!H660","v":{"v":0,"d":"0.00"}},null,{"$error":"#REF!"},{"$error":"#REF!"}]
[null,null,{"$f":"IF('3_Fluorados'!E17=\"\",\"\",'3_Fluorados'!E17)","v":""},{"$f":"INDEX($C$286:$C$351,MATCH(0,INDEX(COUNTIF($D$285:D312,$C$286:$C$351),),))","v":{"$error":"#N/A"}},{"$error":"#N/A"},{"$nulls":19},{"$f":"'7_Factores de emisión'!J482","v":"LA UNION ELECTRO INDUSTRIAL, S.L.U."},{"$f":"'7_Factores de emisión'!N482","v":{"v":0,"d":"0.00"}},{"$f":"'7_Factores de emisión'!E661","v":"IBERDROLA SERVICIOS ENERGETICOS, S.A.U."},{"$f":"'7_Factores de emisión'!H661","v":{"v":0,"d":"0.00"}},null,{"$error":"#REF!"},{"$error":"#REF!"}]
[null,null,{"$f":"IF('3_Fluorados'!E18=\"\",\"\",'3_Fluorados'!E18)","v":""},{"$f":"INDEX($C$286:$C$351,MATCH(0,INDEX(COUNTIF($D$285:D313,$C$286:$C$351),),))","v":{"$error":"#N/A"}},{"$error":"#N/A"},{"$nulls":19},{"$f":"'7_Factores de emisión'!J483","v":"LEDESMA COMERCIALIZADORA ELÉCTRICA, S.L."},{"$f":"'7_Factores de emisión'!N483","v":{"v":0,"d":"0.00"}},{"$f":"'7_Factores de emisión'!E662","v":"IBERELECTRICA COMERCIALIZADORA, S.L."},{"$f":"'7_Factores de emisión'!H662","v":{"v":0.3100000023841858,"d":"0.31"}},null,{"$error":"#REF!"},{"$error":"#REF!"}]
[null,null,{"$f":"IF('3_Fluorados'!E19=\"\",\"\",'3_Fluorados'!E19)","v":""},{"$f":"INDEX($C$286:$C$351,MATCH(0,INDEX(COUNTIF($D$285:D314,$C$286:$C$351),),))","v":{"$error":"#N/A"}},{"$error":"#N/A"},{"$nulls":19},{"$f":"'7_Factores de emisión'!J484","v":"LONJAS TECNOLOGIA, S.A."},{"$f":"'7_Factores de emisión'!N484","v":{"v":0.3400000035762787,"d":"0.34"}},{"$f":"'7_Factores de emisión'!E663","v":"IM3 ENERGÍA, S.L."},{"$f":"'7_Factores de emisión'!H663","v":{"v":0,"d":"0.00"}},null,{"$f":"INDIRECT(\"_Com\"&$F$2)","v":{"$error":"#REF!"}},{"$f":"INDIRECT(\"_Mix\"&$F$2)","v":{"$error":"#REF!"}}]
[null,null,{"$f":"IF('3_Fluorados'!E20=\"\",\"\",'3_Fluorados'!E20)","v":""},{"$f":"INDEX($C$286:$C$351,MATCH(0,INDEX(COUNTIF($D$285:D315,$C$286:$C$351),),))","v":{"$error":"#N/A"}},{"$error":"#N/A"},{"$nulls":19},{"$f":"'7_Factores de emisión'!J485","v":"LUBALOO, S.L."},{"$f":"'7_Factores de emisión'!N485","v":{"v":0,"d":"0.00"}},{"$f":"'7_Factores de emisión'!E664","v":"INDEXO ENERGÍA, S.L."},{"$f":"'7_Factores de emisión'!H664","v":{"v":0.12999999523162842,"d":"0.13"}},null,{"$error":"#REF!"},{"$error":"#REF!"}]
[null,null,{"$f":"IF('3_Fluorados'!E21=\"\",\"\",'3_Fluorados'!E21)","v":""},{"$f":"INDEX($C$286:$C$351,MATCH(0,INDEX(COUNTIF($D$285:D316,$C$286:$C$351),),))","v":{"$error":"#N/A"}},{"$error":"#N/A"},{"$nulls":19},{"$f":"'7_Factores de emisión'!J486","v":"MEGARA ENERGÍA SOCIEDAD COOPERATIVA CYL"},{"$f":"'7_Factores de emisión'!N486","v":{"v":0,"d":"0.00"}},{"$f":"'7_Factores de emisión'!E665","v":"INER ENERGÍA CASTILLA LA MANCHA, S.L."},{"$f":"'7_Factores de emisión'!H665","v":{"v":0.28999999165534973,"d":"0.29"}},null,{"$error":"#REF!"},{"$error":"#REF!"}]
[null,null,{"$f":"IF('3_Fluorados'!E22=\"\",\"\",'3_Fluorados'!E22)","v":""},{"$f":"INDEX($C$286:$C$351,MATCH(0,INDEX(COUNTIF($D$285:D317,$C$286:$C$351),),))","v":{"$error":"#N/A"}},{"$error":"#N/A"},{"$nulls":19},{"$f":"'7_Factores de emisión'!J487","v":"MULTIENERGÍA VERDE, S.L."},{"$f":"'7_Factores de emisión'!N487","v":{"v":0.029999999329447746,"d":"0.03"}},{"$f":"'7_Factores de emisión'!E666","v":"INICIATIVA E. NOVA, S.L."},{"$f":"'7_Factores de emisión'!H666","v":{"v":0,"d":"0.00"}},null,{"$error":"#REF!"},{"$error":"#REF!"}]
[null,null,{"$f":"IF('3_Fluorados'!E23=\"\",\"\",'3_Fluorados'!E23)","v":""},{"$f":"INDEX($C$286:$C$351,MATCH(0,INDEX(COUNTIF($D$285:D318,$C$286:$C$351),),))","v":{"$error":"#N/A"}},{"$error":"#N/A"},{"$nulls":19},{"$f":"'7_Factores de emisión'!J488","v":"NABALIA ENERGÍA 2000, S.A."},{"$f":"'7_Factores de emisión'!N488","v":{"v":0.3100000023841858,"d":"0.31"}},{"$f":"'7_Factores de emisión'!E667","v":"INNOVA DESARROLLO Y EFICIENCIA ENERGÉTICA, S.L."},{"$f":"'7_Factores de emisión'!H667","v":{"v":0,"d":"0.00"}},null,{"$error":"#REF!"},{"$error":"#REF!"}]
[null,null,{"$f":"IF('3_Fluorados'!E24=\"\",\"\",'3_Fluorados'!E24)","v":""},{"$f":"INDEX($C$286:$C$351,MATCH(0,INDEX(COUNTIF($D$285:D319,$C$286:$C$351),),))","v":{"$error":"#N/A"}},{"$error":"#N/A"},{"$nulls":19},{"$f":"'7_Factores de emisión'!J489","v":"NEXUS ENERGÍA, S.A."},{"$f":"'7_Factores de emisión'!N489","v":{"v":0,"d":"0.00"}},{"$f":"'7_Factores de emisión'!E668","v":"INTEGRACIÓN EUROPEA DE ENERGÍA, S.A.U."},{"$f":"'7_Factores de emisión'!H668","v":{"v":0.3100000023841858,"d":"0.31"}},null,{"$error":"#REF!"},{"$error":"#REF!"}]
[null,null,{"$f":"IF('3_Fluorados'!E25=\"\",\"\",'3_Fluorados'!E25)","v":""},{"$f":"INDEX($C$286:$C$351,MATCH(0,INDEX(COUNTIF($D$285:D320,$C$286:$C$351),),))","v":{"$error":"#N/A"}},{"$error":"#N/A"},{"$nulls":19},{"$f":"'7_Factores de emisión'!J490","v":"NINOBE SERVICIOS ENERGÉTICOS, S.L."},{"$f":"'7_Factores de emisión'!N490","v":{"v":0.3700000047683716,"d":"0.37"}},{"$f":"'7_Factores de emisión'!E669","v":"INTEGRACION EUROPEA DE ENERGÍA SUR, S.L."},{"$f":"'7_Factores de emisión'!H669","v":{"v":0.30000001192092896,"d":"0.30"}},null,{"$error":"#REF!"},{"$error":"#REF!"}]
[null,null,{"$f":"IF('3_Fluorados'!E26=\"\",\"\",'3_Fluorados'!E26)","v":""},{"$f":"INDEX($C$286:$C$351,MATCH(0,INDEX(COUNTIF($D$285:D321,$C$286:$C$351),),))","v":{"$error":"#N/A"}},{"$error":"#N/A"},{"$nulls":19},{"$f":"'7_Factores de emisión'!J491","v":"NOBE SOLUCIONES Y ENERGÍA"},{"$f":"'7_Factores de emisión'!N491","v":{"v":0,"d":"0.00"}},{"$f":"'7_Factores de emisión'!E670","v":"INTELIGENCIA PARA EL AHORRO ENERGÉTICO, S.L."},{"$f":"'7_Factores de emisión'!H670","v":{"v":0,"d":"0.00"}},null,{"$error":"#REF!"},{"$error":"#REF!"}]
[null,null,{"$f":"IF('3_Fluorados'!E27=\"\",\"\",'3_Fluorados'!E27)","v":""},{"$f":"INDEX($C$286:$C$351,MATCH(0,INDEX(COUNTIF($D$285:D322,$C$286:$C$351),),))","v":{"$error":"#N/A"}},{"$error":"#N/A"},{"$nulls":19},{"$f":"'7_Factores de emisión'!J492","v":"NOSA ENERXIA SOCIEDADE COOP GALEGA"},{"$f":"'7_Factores de emisión'!N492","v":{"v":0,"d":"0.00"}},{"$f":"'7_Factores de emisión'!E671","v":"KILOWATIOS VERDES, S.L."},{"$f":"'7_Factores de emisión'!H671","v":{"v":0.10999999940395355,"d":"0.11"}},null,{"$error":"#REF!"},{"$error":"#REF!"}]
[null,null,{"$f":"IF('3_Fluorados'!E28=\"\",\"\",'3_Fluorados'!E28)","v":""},{"$f":"INDEX($C$286:$C$351,MATCH(0,INDEX(COUNTIF($D$285:D323,$C$286:$C$351),),))","v":{"$error":"#N/A"}},{"$error":"#N/A"},{"$nulls":19},{"$f":"'7_Factores de emisión'!J493","v":"ODF ENERGÍA LIBRE COMERCIALIZADORA, S.L."},{"$f":"'7_Factores de emisión'!N493","v":{"v":0,"d":"0.00"}},{"$f":"'7_Factores de emisión'!E672","v":"KISHOA, S.L."},{"$f":"'7_Factores de emisión'!H672","v":{"v":0,"d":"0.00"}},null,{"$error":"#REF!"},{"$error":"#REF!"}]
[null,null,{"$f":"IF('3_Fluorados'!E29=\"\",\"\",'3_Fluorados'!E29)","v":""},{"$f":"INDEX($C$286:$C$351,MATCH(0,INDEX(COUNTIF($D$285:D324,$C$286:$C$351),),))","v":{"$error":"#N/A"}},{"$error":"#N/A"},{"$nulls":19},{"$f":"'7_Factores de emisión'!J494","v":"ON DEMAND FACILITIES, S.L.U."},{"$f":"'7_Factores de emisión'!N494","v":{"v":0,"d":"0.00"}},{"$f":"'7_Factores de emisión'!E673","v":"LA CORRIENTE SOCIEDAD COOPERATIVA"},{"$f":"'7_Factores de emisión'!H673","v":{"v":0,"d":"0.00"}},null,{"$error":"#REF!"},{"$error":"#REF!"}]
[null,null,{"$f":"IF('3_Fluorados'!E30=\"\",\"\",'3_Fluorados'!E30)","v":""},{"$f":"INDEX($C$286:$C$351,MATCH(0,INDEX(COUNTIF($D$285:D325,$C$286:$C$351),),))","v":{"$error":"#N/A"}},{"$error":"#N/A"},{"$nulls":19},{"$f":"'7_Factores de emisión'!J495","v":"PEPEENERGY"},{"$f":"'7_Factores de emisión'!N495","v":{"v":0,"d":"0.00"}},{"$f":"'7_Factores de emisión'!E674","v":"LA UNION ELECTRO INDUSTRIAL, S.L.U."},{"$f":"'7_Factores de emisión'!H674","v":{"v":0,"d":"0.00"}},null,{"$error":"#REF!"},{"$error":"#REF!"}]
[null,null,{"$f":"IF('3_Fluorados'!E31=\"\",\"\",'3_Fluorados'!E31)","v":""},{"$f":"INDEX($C$286:$C$351,MATCH(0,INDEX(COUNTIF($D$285:D326,$C$286:$C$351),),))","v":{"$error":"#N/A"}},{"$error":"#N/A"},{"$nulls":19},{"$f":"'7_Factores de emisión'!J496","v":"PETRO NAVARRA, S.L."},{"$f":"'7_Factores de emisión'!N496","v":{"v":0,"d":"0.00"}},{"$f":"'7_Factores de emisión'!E675","v":"LONJAS TECNOLOGIA, S.A."},{"$f":"'7_Factores de emisión'!H675","v":0.25},null,{"$error":"#REF!"},{"$error":"#REF!"}]
[null,null,{"$f":"IF('3_Fluorados'!E32=\"\",\"\",'3_Fluorados'!E32)","v":""},{"$f":"INDEX($C$286:$C$351,MATCH(0,INDEX(COUNTIF($D$285:D327,$C$286:$C$351),),))","v":{"$error":"#N/A"}},{"$error":"#N/A"},{"$nulls":19},{"$f":"'7_Factores de emisión'!J497","v":"PETRONIEVES ENERGÍA 1, S.L."},{"$f":"'7_Factores de emisión'!N497","v":{"v":0.38999998569488525,"d":"0.39"}},{"$f":"'7_Factores de emisión'!E676","v":"LOOP ELECTRICIDAD Y GAS S.L."},{"$f":"'7_Factores de emisión'!H676","v":{"v":0,"d":"0.00"}},null,{"$error":"#REF!"},{"$error":"#REF!"}]
[null,null,{"$f":"IF('3_Fluorados'!E33=\"\",\"\",'3_Fluorados'!E33)","v":""},{"$f":"INDEX($C$286:$C$351,MATCH(0,INDEX(COUNTIF($D$285:D328,$C$286:$C$351),),))","v":{"$error":"#N/A"}},{"$error":"#N/A"},{"$nulls":19},{"$f":"'7_Factores de emisión'!J498","v":"PHOTON GESTION"},{"$f":"'7_Factores de emisión'!N498","v":{"v":0,"d":"0.00"}},{"$f":"'7_Factores de emisión'!E677","v":"LUBALOO, S.L."},{"$f":"'7_Factores de emisión'!H677","v":{"v":0,"d":"0.00"}},null,{"$error":"#REF!"},{"$error":"#REF!"}]
[null,null,{"$f":"IF('4_Electricidad'!E20=\"\",\"\",'4_Electricidad'!E20)","v":""},{"$f":"INDEX($C$286:$C$351,MATCH(0,INDEX(COUNTIF($D$285:D329,$C$286:$C$351),),))","v":{"$error":"#N/A"}},{"$error":"#N/A"},{"$nulls":19},{"$f":"'7_Factores de emisión'!J499","v":"PROT ENERGÍA COMERCIALIZACIÓN, S.L."},{"$f":"'7_Factores de emisión'!N499","v":{"v":0,"d":"0.00"}},{"$f":"'7_Factores de emisión'!E678","v":"LUX FORUM SL"},{"$f":"'7_Factores de emisión'!H678","v":{"v":0.2800000011920929,"d":"0.28"}},null,{"$error":"#REF!"},{"$error":"#REF!"}]
[null,null,{"$f":"IF('4_Electricidad'!E21=\"\",\"\",'4_Electricidad'!E21)","v":""},{"$f":"INDEX($C$286:$C$351,MATCH(0,INDEX(COUNTIF($D$285:D330,$C$286:$C$351),),))","v":{"$error":"#N/A"}},{"$error":"#N/A"},{"$nulls":19},{"$f":"'7_Factores de emisión'!J500","v":"PULSAR SERVICIOS ENERGÉTICOS,"},{"$f":"'7_Factores de emisión'!N500","v":{"v":0,"d":"0.00"}},{"$f":"'7_Factores de emisión'!E679","v":"MEGARA ENERGÍA SOCIEDAD COOPERATIVA CYL"},{"$f":"'7_Factores de emisión'!H679","v":{"v":0,"d":"0.00"}},null,{"$error":"#REF!"},{"$error":"#REF!"}]
[null,null,{"$f":"IF('4_Electricidad'!E22=\"\",\"\",'4_Electricidad'!E22)","v":""},{"$f":"INDEX($C$286:$C$351,MATCH(0,INDEX(COUNTIF($D$285:D331,$C$286:$C$351),),))","v":{"$error":"#N/A"}},{"$error":"#N/A"},{"$nulls":19},{"$f":"'7_Factores de emisión'!J501","v":"REMICA COMERCIALIZADORA, S.A.U."},{"$f":"'7_Factores de emisión'!N501","v":{"v":0.23999999463558197,"d":"0.24"}},{"$f":"'7_Factores de emisión'!E680","v":"MULTIENERGÍA VERDE, S.L."},{"$f":"'7_Factores de emisión'!H680","v":{"v":0,"d":"0.00"}},null,{"$error":"#REF!"},{"$error":"#REF!"}]
[null,null,{"$f":"IF('4_Electricidad'!E23=\"\",\"\",'4_Electricidad'!E23)","v":""},{"$f":"INDEX($C$286:$C$351,MATCH(0,INDEX(COUNTIF($D$285:D332,$C$286:$C$351),),))","v":{"$error":"#N/A"}},{"$error":"#N/A"},{"$nulls":19},{"$f":"'7_Factores de emisión'!J502","v":"RENEWABLE VENTURES, S.L."},{"$f":"'7_Factores de emisión'!N502","v":{"v":0,"d":"0.00"}},{"$f":"'7_Factores de emisión'!E681","v":"NABALIA ENERGÍA 2000, S.A."},{"$f":"'7_Factores de emisión'!H681","v":{"v":0.14000000059604645,"d":"0.14"}},null,{"$error":"#REF!"},{"$error":"#REF!"}]
[null,null,{"$f":"IF('4_Electricidad'!E24=\"\",\"\",'4_Electricidad'!E24)","v":""},{"$f":"INDEX($C$286:$C$351,MATCH(0,INDEX(COUNTIF($D$285:D333,$C$286:$C$351),),))","v":{"$error":"#N/A"}},{"$error":"#N/A"},{"$nulls":19},{"$f":"'7_Factores de emisión'!J503","v":"RESPIRA ENERGÍA, S.A."},{"$f":"'7_Factores de emisión'!N503","v":{"v":0.029999999329447746,"d":"0.03"}},{"$f":"'7_Factores de emisión'!E682","v":"NATURGY IBERIA, S.A."},{"$f":"'7_Factores de emisión'!H682","v":{"v":0.30000001192092896,"d":"0.30"}},null,{"$error":"#REF!"},{"$error":"#REF!"}]
[null,null,{"$f":"IF('4_Electricidad'!E25=\"\",\"\",'4_Electricidad'!E25)","v":""},{"$f":"INDEX($C$286:$C$351,MATCH(0,INDEX(COUNTIF($D$285:D334,$C$286:$C$351),),))","v":{"$error":"#N/A"}},{"$error":"#N/A"},{"$nulls":19},{"$f":"'7_Factores de emisión'!J504","v":"RESPIRA ENERGÍA ESPAÑA, S.L. "},{"$f":"'7_Factores de emisión'!N504","v":{"v":0.3700000047683716,"d":"0.37"}},{"$f":"'7_Factores de emisión'!E683","v":"NATURGY RENOVABLES, S.L.U."},{"$f":"'7_Factores de emisión'!H683","v":{"v":0,"d":"0.00"}},null,{"$error":"#REF!"},{"$error":"#REF!"}]
[null,null,{"$f":"IF('4_Electricidad'!E26=\"\",\"\",'4_Electricidad'!E26)","v":""},{"$f":"INDEX($C$286:$C$351,MATCH(0,INDEX(COUNTIF($D$285:D335,$C$286:$C$351),),))","v":{"$error":"#N/A"}},{"$error":"#N/A"},{"$nulls":19},{"$f":"'7_Factores de emisión'!J505","v":"RTOTAL GAS Y ELECTRICIDAD ESPAÑA, S.A.U."},{"$f":"'7_Factores de emisión'!N505","v":{"v":0.36000001430511475,"d":"0.36"}},{"$f":"'7_Factores de emisión'!E684","v":"NEOWATIO, S.L."},{"$f":"'7_Factores de emisión'!H684","v":{"v":0,"d":"0.00"}},null,{"$error":"#REF!"},{"$error":"#REF!"}]
[null,null,{"$f":"IF('4_Electricidad'!E27=\"\",\"\",'4_Electricidad'!E27)","v":""},{"$f":"INDEX($C$286:$C$351,MATCH(0,INDEX(COUNTIF($D$285:D336,$C$286:$C$351),),))","v":{"$error":"#N/A"}},{"$error":"#N/A"},{"$nulls":19},{"$f":"'7_Factores de emisión'!J506","v":"SAMPOL INGENIERÍA Y OBRAS, S.A."},{"$f":"'7_Factores de emisión'!N506","v":{"v":0.33000001311302185,"d":"0.33"}},{"$f":"'7_Factores de emisión'!E685","v":"NEXUS ENERGÍA, S.A."},{"$f":"'7_Factores de emisión'!H685","v":{"v":0,"d":"0.00"}},null,{"$error":"#REF!"},{"$error":"#REF!"}]
[null,null,{"$f":"IF('4_Electricidad'!E28=\"\",\"\",'4_Electricidad'!E28)","v":""},{"$f":"INDEX($C$286:$C$351,MATCH(0,INDEX(COUNTIF($D$285:D337,$C$286:$C$351),),))","v":{"$error":"#N/A"}},{"$error":"#N/A"},{"$nulls":19},{"$f":"'7_Factores de emisión'!J507","v":"SHELL ESPAÑA, S.A."},{"$f":"'7_Factores de emisión'!N507","v":{"v":0,"d":"0.00"}},{"$f":"'7_Factores de emisión'!E686","v":"NINOBE SERVICIOS ENERGÉTICOS, S.L."},{"$f":"'7_Factores de emisión'!H686","v":{"v":0.28999999165534973,"d":"0.29"}},null,{"$error":"#REF!"},{"$error":"#REF!"}]
[null,null,{"$f":"IF('4_Electricidad'!E29=\"\",\"\",'4_Electricidad'!E29)","v":""},{"$f":"INDEX($C$286:$C$351,MATCH(0,INDEX(COUNTIF($D$285:D338,$C$286:$C$351),),))","v":{"$error":"#N/A"}},{"$error":"#N/A"},{"$nulls":19},{"$f":"'7_Factores de emisión'!J508","v":"SOM ENERGÍA, S.C.C.L."},{"$f":"'7_Factores de emisión'!N508","v":{"v":0,"d":"0.00"}},{"$f":"'7_Factores de emisión'!E687","v":"NOBE SOLUCIONES Y ENERGÍA"},{"$f":"'7_Factores de emisión'!H687","v":{"v":0,"d":"0.00"}},null,{"$error":"#REF!"},{"$error":"#REF!"}]
[null,null,{"$f":"IF('4_Electricidad'!E30=\"\",\"\",'4_Electricidad'!E30)","v":""},{"$f":"INDEX($C$286:$C$351,MATCH(0,INDEX(COUNTIF($D$285:D339,$C$286:$C$351),),))","v":{"$error":"#N/A"}},{"$error":"#N/A"},{"$nulls":19},{"$f":"'7_Factores de emisión'!J509","v":"STIN, S.A."},{"$f":"'7_Factores de emisión'!N509","v":{"v":0.38999998569488525,"d":"0.39"}},{"$f":"'7_Factores de emisión'!E688","v":"NOSA ENERXIA SOCIEDADE COOP GALEGA"},{"$f":"'7_Factores de emisión'!H688","v":{"v":0,"d":"0.00"}},null,{"$error":"#REF!"},{"$error":"#REF!"}]
[null,null,{"$f":"IF('4_Electricidad'!E31=\"\",\"\",'4_Electricidad'!E31)","v":""},{"$f":"INDEX($C$286:$C$351,MATCH(0,INDEX(COUNTIF($D$285:D340,$C$286:$C$351),),))","v":{"$error":"#N/A"}},{"$error":"#N/A"},{"$nulls":19},{"$f":"'7_Factores de emisión'!J510","v":"SUMINISTRADORA ELECTRICA VIENTOS ALISIOS DE LANZAROTE S.L."},{"$f":"'7_Factores de emisión'!N510","v":{"v":0,"d":"0.00"}},{"$f":"'7_Factores de emisión'!E689","v":"ODF ENERGÍA LIBRE COMERCIALIZADORA, S.L."},{"$f":"'7_Factores de emisión'!H689","v":{"v":0,"d":"0.00"}},null,{"$error":"#REF!"},{"$error":"#REF!"}]
[null,null,{"$f":"IF('4_Electricidad'!E32=\"\",\"\",'4_Electricidad'!E32)","v":""},{"$f":"INDEX($C$286:$C$351,MATCH(0,INDEX(COUNTIF($D$285:D341,$C$286:$C$351),),))","v":{"$error":"#N/A"}},{"$error":"#N/A"},{"$nulls":19},{"$f":"'7_Factores de emisión'!J511","v":"SUMINISTROS ESPECIALES ALGINETENSES COOP. V."},{"$f":"'7_Factores de emisión'!N511","v":{"v":0,"d":"0.00"}},{"$f":"'7_Factores de emisión'!E690","v":"ON DEMAND FACILITIES, S.L.U."},{"$f":"'7_Factores de emisión'!H690","v":{"v":0,"d":"0.00"}},null,{"$error":"#REF!"},{"$error":"#REF!"}]
[null,null,{"$f":"IF('4_Electricidad'!E33=\"\",\"\",'4_Electricidad'!E33)","v":""},{"$f":"INDEX($C$286:$C$351,MATCH(0,INDEX(COUNTIF($D$285:D342,$C$286:$C$351),),))","v":{"$error":"#N/A"}},{"$error":"#N/A"},{"$nulls":19},{"$f":"'7_Factores de emisión'!J512","v":"SUNAIR ONE ENERGY, S.L."},{"$f":"'7_Factores de emisión'!N512","v":{"v":0.3799999952316284,"d":"0.38"}},{"$f":"'7_Factores de emisión'!E691","v":"OVO ENERGY SPAIN, S.L."},{"$f":"'7_Factores de emisión'!H691","v":{"v":0,"d":"0.00"}},null,{"$error":"#REF!"},{"$error":"#REF!"}]
[null,null,{"$f":"IF('4_Electricidad'!E34=\"\",\"\",'4_Electricidad'!E34)","v":""},{"$f":"INDEX($C$286:$C$351,MATCH(0,INDEX(COUNTIF($D$285:D343,$C$286:$C$351),),))","v":{"$error":"#N/A"}},{"$error":"#N/A"},{"$nulls":19},{"$f":"'7_Factores de emisión'!J513","v":"SUNAIR ONE HOME, S.L."},{"$f":"'7_Factores de emisión'!N513","v":{"v":0.20000000298023224,"d":"0.20"}},{"$f":"'7_Factores de emisión'!E692","v":"PEPEENERGY"},{"$f":"'7_Factores de emisión'!H692","v":{"v":0,"d":"0.00"}},null,{"$error":"#REF!"},{"$error":"#REF!"}]
[null,null,{"$f":"IF('4_Electricidad'!E35=\"\",\"\",'4_Electricidad'!E35)","v":""},{"$f":"INDEX($C$286:$C$351,MATCH(0,INDEX(COUNTIF($D$285:D344,$C$286:$C$351),),))","v":{"$error":"#N/A"}},{"$error":"#N/A"},{"$nulls":19},{"$f":"'7_Factores de emisión'!J514","v":"SYDER COMERCIALIZADORA VERDE, S.L."},{"$f":"'7_Factores de emisión'!N514","v":{"v":0,"d":"0.00"}},{"$f":"'7_Factores de emisión'!E693","v":"PETRO NAVARRA, S.L."},{"$f":"'7_Factores de emisión'!H693","v":{"v":0,"d":"0.00"}},null,{"$error":"#REF!"},{"$error":"#REF!"}]
[null,null,{"$f":"IF('4_Electricidad'!E36=\"\",\"\",'4_Electricidad'!E36)","v":""},{"$f":"INDEX($C$286:$C$351,MATCH(0,INDEX(COUNTIF($D$285:D345,$C$286:$C$351),),))","v":{"$error":"#N/A"}},{"$error":"#N/A"},{"$nulls":19},{"$f":"'7_Factores de emisión'!J515","v":"TELEFONICA SOLUCIONES DE INFORMATICA Y COMUNICACIONES DE ESPAÑA, S.A.U."},{"$f":"'7_Factores de emisión'!N515","v":{"v":0.20000000298023224,"d":"0.20"}},{"$f":"'7_Factores de emisión'!E694","v":"PHOTON GESTIÓN"},{"$f":"'7_Factores de emisión'!H694","v":{"v":0,"d":"0.00"}},null,{"$error":"#REF!"},{"$error":"#REF!"}]
[null,null,{"$f":"IF('4_Electricidad'!E37=\"\",\"\",'4_Electricidad'!E37)","v":""},{"$f":"INDEX($C$286:$C$351,MATCH(0,INDEX(COUNTIF($D$285:D346,$C$286:$C$351),),))","v":{"$error":"#N/A"}},{"$error":"#N/A"},{"$nulls":19},{"$f":"'7_Factores de emisión'!J516","v":"THE YELLOW ENERGY, S.L."},{"$f":"'7_Factores de emisión'!N516","v":{"v":0,"d":"0.00"}},{"$f":"'7_Factores de emisión'!E695","v":"POTENZIA COMERCIALIZADORA, S.L."},{"$f":"'7_Factores de emisión'!H695","v":{"v":0,"d":"0.00"}},null,{"$error":"#REF!"},{"$error":"#REF!"}]
[null,null,{"$f":"IF('4_Electricidad'!E38=\"\",\"\",'4_Electricidad'!E38)","v":""},{"$f":"INDEX($C$286:$C$351,MATCH(0,INDEX(COUNTIF($D$285:D347,$C$286:$C$351),),))","v":{"$error":"#N/A"}},{"$error":"#N/A"},{"$nulls":19},{"$f":"'7_Factores de emisión'!J517","v":"TOTAL GAS Y ELECTRICIDAD ESPAÑA S.A.U."},{"$f":"'7_Factores de emisión'!N517","v":{"v":0.3799999952316284,"d":"0.38"}},{"$f":"'7_Factores de emisión'!E696","v":"PROT ENERGÍA COMERCIALIZACIÓN, S.L."},{"$f":"'7_Factores de emisión'!H696","v":{"v":0,"d":"0.00"}},null,{"$error":"#REF!"},{"$error":"#REF!"}]
[null,null,{"$f":"IF('4_Electricidad'!E39=\"\",\"\",'4_Electricidad'!E39)","v":""},{"$f":"INDEX($C$286:$C$351,MATCH(0,INDEX(COUNTIF($D$285:D348,$C$286:$C$351),),))","v":{"$error":"#N/A"}},{"$error":"#N/A"},{"$nulls":19},{"$f":"'7_Factores de emisión'!J518","v":"TRACTAMENT I SELECCIÓ DE RESIDUS, S.A."},{"$f":"'7_Factores de emisión'!N518","v":{"v":0,"d":"0.00"}},{"$f":"'7_Factores de emisión'!E697","v":"PULSAR SERVICIOS ENERGÉTICOS"},{"$f":"'7_Factores de emisión'!H697","v":{"v":0,"d":"0.00"}},null,{"$error":"#REF!"},{"$error":"#REF!"}]
[null,null,{"$f":"IF('4_Electricidad'!E40=\"\",\"\",'4_Electricidad'!E40)","v":""},{"$f":"INDEX($C$286:$C$351,MATCH(0,INDEX(COUNTIF($D$285:D349,$C$286:$C$351),),))","v":{"$error":"#N/A"}},{"$error":"#N/A"},{"$nulls":19},{"$f":"'7_Factores de emisión'!J519","v":"TRADE UNIVERSAL ENERGY, S.A."},{"$f":"'7_Factores de emisión'!N519","v":{"v":0,"d":"0.00"}},{"$f":"'7_Factores de emisión'!E698","v":"REMICA COMERCIALIZADORA, S.A.U."},{"$f":"'7_Factores de emisión'!H698","v":{"v":0.20999999344348907,"d":"0.21"}},null,{"$error":"#REF!"},{"$error":"#REF!"}]
[null,null,{"$f":"IF('4_Electricidad'!E41=\"\",\"\",'4_Electricidad'!E41)","v":""},{"$f":"INDEX($C$286:$C$351,MATCH(0,INDEX(COUNTIF($D$285:D350,$C$286:$C$351),),))","v":{"$error":"#N/A"}},{"$error":"#N/A"},{"$nulls":19},{"$f":"'7_Factores de emisión'!J520","v":"UNIELÉCTRICA ENERGÍA, S.A."},{"$f":"'7_Factores de emisión'!N520","v":{"v":0,"d":"0.00"}},{"$f":"'7_Factores de emisión'!E699","v":"RENEWABLE VENTURES, S.L."},{"$f":"'7_Factores de emisión'!H699","v":{"v":0,"d":"0.00"}},null,{"$error":"#REF!"},{"$error":"#REF!"}]
[{"$nulls":24},{"$f":"'7_Factores de emisión'!J521","v":"V3J INGENIERIA Y SERVICIOS, S.L."},{"$f":"'7_Factores de emisión'!N521","v":{"v":0.30000001192092896,"d":"0.30"}},{"$f":"'7_Factores de emisión'!E700","v":"REPSOL COMERCIALIZADORA DE ELECTRICIDAD Y GAS, S.L.U."},{"$f":"'7_Factores de emisión'!H700","v":{"v":0.019999999552965164,"d":"0.02"}},null,{"$error":"#REF!"},{"$error":"#REF!"}]
[{"$nulls":24},{"$f":"'7_Factores de emisión'!J522","v":"VIESGO ENERGÍA, S.L."},{"$f":"'7_Factores de emisión'!N522","v":{"v":0.20999999344348907,"d":"0.21"}},{"$f":"'7_Factores de emisión'!E701","v":"RESPIRA ENERGÍA ESPAÑA, S.L. "},{"$f":"'7_Factores de emisión'!H701","v":{"v":0.3100000023841858,"d":"0.31"}},null,{"$error":"#REF!"},{"$error":"#REF!"}]
[{"$nulls":24},{"$f":"'7_Factores de emisión'!J523","v":"VIRTUS GLOBAL ENERGY SL"},{"$f":"'7_Factores de emisión'!N523","v":{"v":0,"d":"0.00"}},{"$f":"'7_Factores de emisión'!E702","v":"RESPIRA ENERGÍA, S.A."},{"$f":"'7_Factores de emisión'!H702","v":{"v":0.05000000074505806,"d":"0.05"}},null,{"$error":"#REF!"},{"$error":"#REF!"}]
[{"$nulls":24},{"$f":"'7_Factores de emisión'!J524","v":"VIVE ENERGÍA ELÉCTRICA, S.A"},{"$f":"'7_Factores de emisión'!N524","v":{"v":0.4099999964237213,"d":"0.41"}},{"$f":"'7_Factores de emisión'!E703","v":"ROFEICA ENERGÍA, S.A"},{"$f":"'7_Factores de emisión'!H703","v":{"v":0.30000001192092896,"d":"0.30"}},null,{"$error":"#REF!"},{"$error":"#REF!"}]
[{"$nulls":24},{"$f":"'7_Factores de emisión'!J525","v":"WATIO WHOLESALE, S.L."},{"$f":"'7_Factores de emisión'!N525","v":{"v":0.38999998569488525,"d":"0.39"}},{"$f":"'7_Factores de emisión'!E704","v":"RONDA OESTE ENERGÍA, S.L."},{"$f":"'7_Factores de emisión'!H704","v":{"v":0.28999999165534973,"d":"0.29"}},null,{"$error":"#REF!"},{"$error":"#REF!"}]
[{"$nulls":24},{"$f":"'7_Factores de emisión'!J526","v":"WATIUM, S.L."},{"$f":"'7_Factores de emisión'!N526","v":{"v":0.3499999940395355,"d":"0.35"}},{"$f":"'7_Factores de emisión'!E705","v":"SAMPOL INGENIERÍA Y OBRAS, S.A."},{"$f":"'7_Factores de emisión'!H705","v":{"v":0.18000000715255737,"d":"0.18"}},null,{"$error":"#REF!"},{"$error":"#REF!"}]
[{"$nulls":24},{"$f":"'7_Factores de emisión'!J527","v":"WIND TO MARKET, S.A."},{"$f":"'7_Factores de emisión'!N527","v":{"v":0.20000000298023224,"d":"0.20"}},{"$f":"'7_Factores de emisión'!E706","v":"SHELL ESPAÑA, S.A."},{"$f":"'7_Factores de emisión'!H706","v":{"v":0,"d":"0.00"}},null,{"$error":"#REF!"},{"$error":"#REF!"}]
[{"$nulls":24},"Varias comercializadoras",{"$f":"'7_Factores de emisión'!J352","v":0.41},{"$f":"'7_Factores de emisión'!E707","v":"SOM ENERGÍA, S.C.C.L."},{"$f":"'7_Factores de emisión'!H707","v":{"v":0,"d":"0.00"}},null,{"$error":"#REF!"},{"$error":"#REF!"}]
[{"$nulls":24},"Otras",{"$f":"Z359","v":0.41},{"$f":"'7_Factores de emisión'!E708","v":"STIN, S.A."},{"$f":"'7_Factores de emisión'!H708","v":{"v":0.23999999463558197,"d":"0.24"}},null,{"$error":"#REF!"},{"$error":"#REF!"}]
[{"$nulls":26},{"$f":"'7_Factores de emisión'!E709","v":"SUMINISTRADORA ELECTRICA VIENTOS ALISIOS DE LANZAROTE, S.L."},{"$f":"'7_Factores de emisión'!H709","v":{"v":0,"d":"0.00"}},null,{"$error":"#REF!"},{"$error":"#REF!"}]
[{"$nulls":26},{"$f":"'7_Factores de emisión'!E710","v":"SUMINISTROS ESPECIALES ALGINETENSES COOP. V."},{"$f":"'7_Factores de emisión'!H710","v":{"v":0,"d":"0.00"}},null,{"$error":"#REF!"},{"$error":"#REF!"}]
[{"$nulls":26},{"$f":"'7_Factores de emisión'!E711","v":"SUNAIR ONE ENERGY, S.L."},{"$f":"'7_Factores de emisión'!H711","v":{"v":0,"d":"0.00"}},null,{"$error":"#REF!"},{"$error":"#REF!"}]
[{"$nulls":26},{"$f":"'7_Factores de emisión'!E712","v":"SUNAIR ONE HOME, S.L."},{"$f":"'7_Factores de emisión'!H712","v":{"v":0,"d":"0.00"}},null,{"$error":"#REF!"},{"$error":"#REF!"}]
[{"$nulls":26},{"$f":"'7_Factores de emisión'!E713","v":"SYDER COMERCIALIZADORA VERDE, S.L."},{"$f":"'7_Factores de emisión'!H713","v":{"v":0,"d":"0.00"}},null,{"$error":"#REF!"},{"$error":"#REF!"}]
[{"$nulls":26},{"$f":"'7_Factores de emisión'!E714","v":"TELEFONICA SOLUCIONES DE INFORMATICA Y COMUNICACIONES DE ESPAÑA, S.A.U."},{"$f":"'7_Factores de emisión'!H714","v":{"v":0,"d":"0.00"}},null,{"$error":"#REF!"},{"$error":"#REF!"}]
[{"$nulls":26},{"$f":"'7_Factores de emisión'!E715","v":"TERUGAS ENERGY, S.L."},{"$f":"'7_Factores de emisión'!H715","v":{"v":0,"d":"0.00"}},null,{"$error":"#REF!"},{"$error":"#REF!"}]
[{"$nulls":26},{"$f":"'7_Factores de emisión'!E716","v":"THE ENERGY HOUSE GROUP, S.L."},{"$f":"'7_Factores de emisión'!H716","v":{"v":0,"d":"0.00"}},null,{"$error":"#REF!"},{"$error":"#REF!"}]
[{"$nulls":26},{"$f":"'7_Factores de emisión'!E717","v":"THE YELLOW ENERGY, S.L."},{"$f":"'7_Factores de emisión'!H717","v":{"v":0,"d":"0.00"}},null,{"$error":"#REF!"},{"$error":"#REF!"}]
[{"$nulls":26},{"$f":"'7_Factores de emisión'!E718","v":"TOTAL GAS Y ELECTRICIDAD ESPAÑA, S.A.U."},{"$f":"'7_Factores de emisión'!H718","v":{"v":0.30000001192092896,"d":"0.30"}},null,{"$error":"#REF!"},{"$error":"#REF!"}]
[{"$nulls":26},{"$f":"'7_Factores de emisión'!E719","v":"TRACTAMENT I SELECCIÓ DE RESIDUS, S.A."},{"$f":"'7_Factores de emisión'!H719","v":{"v":0,"d":"0.00"}},null,{"$error":"#REF!"},{"$error":"#REF!"}]
[{"$nulls":26},{"$f":"'7_Factores de emisión'!E720","v":"TRADE UNIVERSAL ENERGY, S.A."},{"$f":"'7_Factores de emisión'!H720","v":{"v":0,"d":"0.00"}},null,{"$error":"#REF!"},{"$error":"#REF!"}]
[{"$nulls":26},{"$f":"'7_Factores de emisión'!E721","v":"UNIELÉCTRICA ENERGÍA, S.A."},{"$f":"'7_Factores de emisión'!H721","v":{"v":0,"d":"0.00"}},null,{"$error":"#REF!"},{"$error":"#REF!"}]
[{"$nulls":26},{"$f":"'7_Factores de emisión'!E722","v":"VIRTUS GLOBAL ENERGY, S.L."},{"$f":"'7_Factores de emisión'!H722","v":{"v":0,"d":"0.00"}},null,{"$error":"#REF!"},{"$error":"#REF!"}]
[{"$nulls":26},{"$f":"'7_Factores de emisión'!E723","v":"VISALIA ENERGÍA, S.L."},{"$f":"'7_Factores de emisión'!H723","v":{"v":0,"d":"0.00"}},null,{"$error":"#REF!"},{"$error":"#REF!"}]
[{"$nulls":26},{"$f":"'7_Factores de emisión'!E724","v":"VIVE ENERGÍA ELÉCTRICA, S.A."},{"$f":"'7_Factores de emisión'!H724","v":{"v":0,"d":"0.00"}},null,{"$error":"#REF!"},{"$error":"#REF!"}]
[{"$nulls":26},{"$f":"'7_Factores de emisión'!E725","v":"VIVO ENERGÍA FUTURA, S.A."},{"$f":"'7_Factores de emisión'!H725","v":{"v":0,"d":"0.00"}},null,{"$error":"#REF!"},{"$error":"#REF!"}]
[{"$nulls":26},{"$f":"'7_Factores de emisión'!E726","v":"VÓLTICO ENERGÍA, S.L."},{"$f":"'7_Factores de emisión'!H726","v":{"v":0,"d":"0.00"}},null,{"$error":"#REF!"},{"$error":"#REF!"}]
[{"$nulls":26},{"$f":"'7_Factores de emisión'!E727","v":"V3J INGENIERIA Y SERVICIOS, S.L."},{"$f":"'7_Factores de emisión'!H727","v":{"v":0.05000000074505806,"d":"0.05"}},null,{"$f":"INDIRECT(\"_Com\"&$F$2)","v":{"$error":"#REF!"}},{"$f":"INDIRECT(\"_Mix\"&$F$2)","v":{"$error":"#REF!"}}]
[{"$nulls":26},{"$f":"'7_Factores de emisión'!E728","v":"WATIO WHOLESALE, S.L."},{"$f":"'7_Factores de emisión'!H728","v":{"v":0.27000001072883606,"d":"0.27"}},null,{"$error":"#REF!"},{"$error":"#REF!"}]
[{"$nulls":26},{"$f":"'7_Factores de emisión'!E729","v":"WATIUM, S.L."},{"$f":"'7_Factores de emisión'!H729","v":{"v":0.2800000011920929,"d":"0.28"}},null,{"$error":"#REF!"},{"$error":"#REF!"}]
[{"$nulls":26},{"$f":"'7_Factores de emisión'!E730","v":"WIND TO MARKET, S.A."},{"$f":"'7_Factores de emisión'!H730","v":{"v":0.20999999344348907,"d":"0.21"}},null,{"$error":"#REF!"},{"$error":"#REF!"}]
[{"$nulls":26},{"$f":"'7_Factores de emisión'!E731","v":"24-7 UTILITIES, S.L.U."},{"$f":"'7_Factores de emisión'!H731","v":{"v":0,"d":"0.00"}},null,{"$error":"#REF!"},{"$error":"#REF!"}]
[{"$nulls":26},"Varias comercializadoras",{"$f":"'7_Factores de emisión'!E531","v":{"v":0.3100000023841858,"d":"0.31"}},null,{"$error":"#REF!"},{"$error":"#REF!"}]
[{"$nulls":26},"Otras",{"$f":"AB384","v":{"v":0.3100000023841858,"d":"0.31"}},null,{"$error":"#REF!"},{"$error":"#REF!"}]